program: Gaussian 09
title: 000288477
version: EM64L-G09RevD.01
frameworkgroup: C1[X(C14H11BrS)]
method: RPBEPBE
basis: SDD
operation: Freq
keyword: #p
keyword: freq=noraman
keyword: PBEPBE/SDD
title: #p freq=noraman PBEPBE/SDD
converged: YES YES NO NO
title: Mulliken charges:
elementType: Br S C C C C C C C C C C C C C C H H H H H H H H H H H
charge: 0.026738 0.298553 -0.597263 0.348684 -0.458069 0.144538 0.290562 -0.369579 0.514424 -0.438513 -0.361241 -0.241333 -0.255161 -0.215364 -0.775179 -0.559442 0.224993 0.230791 0.224193 0.219464 0.244819 0.234126 0.247806 0.226125 0.226874 0.287437 0.281016
chargesum: 0.00000
title: Mulliken charges with hydrogens summed into heavy atoms:
elementType: Br S C C C C C C C C C C C C C C
charge: 0.026738 0.298553 -0.141480 0.348684 -0.014412 0.144538 0.290562 -0.124760 0.514424 -0.204387 -0.113435 -0.015207 -0.028287 -0.215364 -0.487742 -0.278426
polarizability: 2.14586279e+02 -1.99062309e+01 1.72168191e+02 -1.90271029e+01 -1.56755791e+01 1.42165251e+02
1716.lowfreq: -7.0575 -0.0019 -0.0016 -0.0006 3.3573 5.1915 28.2030 48.6260 71.3573
frequency: 28.1864 48.6244 71.3497 113.7297 145.8323 162.5656 199.0492 219.2999 262.0931 292.9719 317.4408 350.8636 406.3044 426.2431 450.7348 480.9128 494.0546 515.9511 583.0775 624.7953 635.7489 665.5869 690.8326 713.5231 741.8503 750.3869 775.5020 782.2986 788.6776 802.6721 819.1529 848.1302 881.3137 907.7916 920.3198 951.6530 988.5614 1008.9913 1030.2077 1040.4705 1057.6337 1110.4809 1150.7540 1157.2849 1160.4591 1175.3370 1196.2120 1215.7173 1236.8821 1282.0775 1312.4569 1333.4158 1344.5567 1356.6664 1381.1954 1438.5182 1446.8530 1451.8293 1456.9218 1485.4531 1530.0852 1577.1058 1611.4212 1634.5327 2946.3034 2958.1066 3039.0108 3042.5882 3116.5611 3128.6781 3129.8867 3141.8900 3161.2040 3233.6651 3250.7615
redmass: 7.5691 6.9429 5.6640 4.1495 3.5450 5.5164 4.2163 6.5038 3.8749 3.1434 9.0967 4.0694 4.1198 3.1245 4.6666 3.8270 5.0176 5.1573 4.4721 3.8088 4.8326 1.9184 2.9180 2.3872 3.2987 2.7012 1.6155 4.2499 1.4906 4.4848 2.2843 1.6533 1.3611 3.2461 2.6562 1.4014 1.3273 3.7438 2.0968 2.2366 2.1834 1.7660 1.3434 1.2198 1.3846 1.0777 1.3795 2.2890 1.5811 1.3556 1.6773 1.6594 4.4912 1.9129 5.7426 2.4202 4.2470 1.2297 1.1066 2.6954 8.9777 6.4120 6.4793 7.9582 1.0694 1.0641 1.0910 1.0960 1.0867 1.0881 1.0920 1.0938 1.1006 1.0956 1.0974
irintensity: 0.0161 0.3394 0.2595 0.5729 0.9043 0.4217 1.3630 0.6894 3.2028 1.0729 1.1472 0.7422 0.9840 3.1379 2.8620 3.3776 0.9808 2.8326 1.4975 6.7287 13.9821 0.1633 4.8899 2.9250 4.5816 56.7156 33.9732 4.1458 75.0132 23.2473 38.3834 1.4787 0.4322 12.7681 4.0537 1.3505 0.0518 22.5902 2.9492 7.6725 1.7987 3.1925 0.6277 0.7435 0.7698 1.2332 3.3067 0.5080 14.4513 4.0398 2.0113 12.1010 8.4460 3.4015 0.3064 7.3563 2.9312 10.0582 13.4535 14.7403 7.1703 0.8206 1.1741 0.5986 30.4245 32.7837 45.9199 30.8725 8.5206 3.4841 12.2729 32.0924 30.8631 1.1556 2.3044
temp: 298.150 k
press: 1.00000 atm
elementType: 35 16 6 6 6 6 6 6 6 6 6 6 6 6 6 6 1 1 1 1 1 1 1 1 1 1 1
symmnumber: 1
zpe: 533476.2 jmol-1
zpe.correction: 0.203190 hartree
zpe.thermalcorrener: 0.216887 hartree
zpe.thermalcorrenthalpy: 0.217831 hartree
zpe.thermalcorrgfe: 0.160982 hartree
zpe.sumelectzpe: -950.476654 hartree
zpe.sumelectthermal: -950.462957 hartree
zpe.sumelectthermalent: -950.462013 hartree
zpe.sumelectthermalfe: -950.518863 hartree
dipole: 0.7545 1.3921 -0.0251
dipole: 1.5836
quadrupole: -100.1359 -104.4409 -108.5922
quadrupole: 1.1378 -3.7558 -4.0020
quadrupole: 4.2538 -0.0512 -4.2025 1.1378 -3.7558 -4.0020
hfenergy: -950.6798442 hartree
pointgroup: C01 [X(C14H11Br1S1)]
dipole: 0.2404667 -0.3540456 -0.4527803 debye
polarizability: 215.45629|-8.5371|168.3383432|26.3275243|16.6672975|145.125088 unknown
InChI: InChI=1S/C14H11BrS/c15-14-9-16-8-13(14)12-7-3-5-10-4-1-2-6-11(10)12/h1-2,4,6-9H,3,5H2
charge 0 multiplicity 1
27 atoms
Br -1.508827 0.396865 2.595525
S  -4.061358 0.64208 -1.114719
C  2.270902 -1.981108 0.185892
C  2.193467 -0.461372 0.140812
C  1.324775 -2.625908 -0.853399
C  0.92585 0.153904 -0.106347
C  -0.250488 -0.711166 -0.395435
C  -0.062764 -2.01891 -0.760629
C  -1.627012 -0.139555 -0.352316
C  3.322077 0.350365 0.381733
C  0.829718 1.569394 -0.102723
C  3.217152 1.761954 0.384944
C  1.965326 2.370822 0.142025
C  -2.304144 0.395719 0.820753
C  -2.451853 -0.07213 -1.467262
C  -3.589852 0.849345 0.605387
H  3.310459 -2.323675 0.03264
H  1.964494 -2.323289 1.197516
H  1.725822 -2.470966 -1.879169
H  1.274758 -3.719202 -0.697804
H  -0.931488 -2.643422 -1.002182
H  4.29259 -0.12433 0.571916
H  -0.138547 2.043388 -0.298659
H  4.103441 2.3781 0.573518
H  1.874811 3.462636 0.142353
H  -2.214068 -0.368406 -2.487295
H  -4.299143 1.264363 1.316722
