program: Gaussian 09
title: 000288476
version: EM64L-G09RevD.01
frameworkgroup: C1[X(C15H10O2S)]
method: RPBEPBE
basis: SDD
operation: Freq
keyword: #p
keyword: freq=noraman
keyword: PBEPBE/SDD
title: #p freq=noraman PBEPBE/SDD
converged: YES YES NO NO
title: Mulliken charges:
elementType: S O O C C C C C C C C C C C C C C C H H H H H H H H H H
charge: 0.321795 -0.442138 -0.224064 0.310934 0.197915 0.392457 0.392838 -0.419065 0.220410 -0.380139 -0.457404 -0.240191 -0.437071 -0.764607 -0.255229 -0.247079 -0.680777 0.089861 0.245541 0.243685 0.238339 0.227117 0.236305 0.289789 0.226426 0.227268 0.302634 0.384450
chargesum: 0.00000
title: Mulliken charges with hydrogens summed into heavy atoms:
elementType: S O O C C C C C C C C C C C C C C C
charge: 0.321795 -0.057688 -0.224064 0.310934 0.197915 0.392457 0.392838 -0.173524 0.220410 -0.136454 -0.219065 -0.013074 -0.200767 -0.474818 -0.028803 -0.019812 -0.378143 0.089861
polarizability: 2.35715164e+02 1.12193530e+01 1.81263009e+02 1.76146667e+01 -2.02201821e+01 1.34123682e+02
1716.lowfreq: -5.3628 0.0009 0.0017 0.0018 7.8173 8.6037 25.7891 43.0631 58.5881
frequency: 25.7152 43.0565 58.5877 83.2539 134.3935 153.8453 178.7353 196.7464 245.3423 286.1826 288.7037 376.4556 409.7305 426.3072 452.7343 473.7196 490.2526 511.9448 521.9682 573.2151 580.6394 601.3832 629.7396 652.6814 661.6681 690.4594 715.7316 747.2209 765.8987 776.1557 788.0102 792.7826 814.1274 818.9404 821.9657 833.9846 883.8770 919.6001 924.6885 965.1758 984.4058 988.0094 994.5393 1024.7928 1058.3165 1094.8360 1128.9213 1151.9728 1172.9061 1174.4341 1186.4304 1235.3162 1245.0116 1267.9718 1292.9277 1362.9978 1387.6316 1409.3850 1417.4943 1436.8511 1447.6557 1468.2281 1512.0022 1534.8767 1590.4284 1595.8455 1632.0350 1652.8600 3120.1421 3123.4262 3129.9409 3137.7714 3145.1514 3159.4086 3162.0308 3236.0949 3249.5896 3531.5220
redmass: 6.7060 10.0290 6.0539 7.0707 4.9833 5.1352 4.2467 5.4641 7.7721 5.4190 6.2653 8.2914 4.5059 3.8489 3.7150 3.2896 5.5754 6.2715 5.5381 3.6471 1.3418 6.9738 4.6484 4.3805 3.9996 4.8743 1.5416 1.3058 3.5132 4.6788 4.0187 2.1026 3.3200 1.8132 1.5876 4.1588 1.7391 1.5036 4.9506 1.3671 1.3772 4.8080 1.3376 2.5914 2.3097 2.1873 1.3948 1.3587 1.1477 1.2221 1.2939 1.7821 1.7526 1.6751 2.5669 2.5322 4.1564 3.7167 5.4116 2.8005 2.8684 4.9214 4.1916 7.9846 7.7038 5.3438 6.6359 8.8915 1.0859 1.0863 1.0880 1.0917 1.0948 1.0994 1.1004 1.0958 1.0964 1.0642
irintensity: 0.0122 0.7450 1.0376 0.1774 1.0313 0.3582 1.6633 0.0364 0.7825 1.6134 1.1207 6.3524 2.1596 6.1371 9.0324 0.2413 23.6948 3.8691 8.7662 3.5860 80.6959 22.7537 18.6235 15.3491 34.5553 5.3159 7.1390 1.6192 25.6553 6.3958 13.7867 62.4496 19.4128 59.4859 32.3283 31.9615 4.2968 1.6223 43.3087 1.8482 0.9985 209.0398 0.3188 11.7097 10.5233 66.6969 51.5444 0.7828 10.6967 19.4303 0.3315 3.0750 3.3714 3.7172 24.2592 10.9817 41.3344 5.5624 0.1690 2.7179 10.8529 39.3824 8.0776 8.2085 0.4441 4.1844 0.2125 294.6808 1.7041 1.2132 3.4992 16.5387 37.3769 42.3097 20.0610 2.1903 7.2277 42.9956
temp: 298.150 k
press: 1.00000 atm
elementType: 16 8 8 6 6 6 6 6 6 6 6 6 6 6 6 6 6 6 1 1 1 1 1 1 1 1 1 1
symmnumber: 1
zpe: 536882.7 jmol-1
zpe.correction: 0.204488 hartree
zpe.thermalcorrener: 0.219031 hartree
zpe.thermalcorrenthalpy: 0.219975 hartree
zpe.thermalcorrgfe: 0.161515 hartree
zpe.sumelectzpe: -1124.885832 hartree
zpe.sumelectthermal: -1124.871289 hartree
zpe.sumelectthermalent: -1124.870344 hartree
zpe.sumelectthermalfe: -1124.928805 hartree
dipole: -0.6965 -0.1564 -0.6335
dipole: 0.9544
quadrupole: -98.8771 -99.2604 -110.9742
quadrupole: -2.6311 -1.1812 -2.1203
quadrupole: 4.1601 3.7769 -7.9370 -2.6311 -1.1812 -2.1203
hfenergy: -1125.0903197 hartree
pointgroup: C01 [X(C15H10O2S1)]
dipole: 0.2317196 -0.1554597 -0.2512813 debye
polarizability: 226.8797441|-11.9153461|177.5186641|-34.2945614|-21.8141097|146.7034466 unknown
InChI: InChI=1S/C15H10O2S/c16-15(17)14-9-18-8-13(14)12-7-3-5-10-4-1-2-6-11(10)12/h1-9,16H
charge 0 multiplicity 1
28 atoms
S  3.47688 -0.436042 -2.206259
O  3.076541 -0.837324 2.274258
O  1.045004 0.28725 2.19065
C  -0.099832 0.773959 -0.603648
C  -1.156007 -0.116059 -0.176788
C  1.28052 0.266253 -0.870924
C  -2.477341 0.429446 0.064526
C  -0.378287 2.132369 -0.806798
C  2.24161 -0.224327 0.118169
C  -0.954877 -1.52476 0.000488
C  -2.712307 1.829726 -0.137258
C  -1.683397 2.66427 -0.572511
C  -3.529681 -0.447252 0.490491
C  1.800173 0.213826 -2.154313
C  -2.000238 -2.355262 0.41077
C  -3.299321 -1.812959 0.664242
C  3.448901 -0.635617 -0.439607
C  2.017976 -0.211621 1.580375
H  0.428299 2.80039 -1.128037
H  0.033713 -1.951994 -0.199613
H  -3.714675 2.232035 0.052243
H  -1.864591 3.732998 -0.729436
H  -4.52473 -0.024286 0.674832
H  1.308448 0.487425 -3.085835
H  -1.828207 -3.42956 0.540439
H  -4.110382 -2.473954 0.989127
H  4.32059 -1.01833 0.085794
H  2.884817 -0.7812 3.248723
