program: Gaussian 09
title: 000288471
version: EM64L-G09RevD.01
frameworkgroup: C1[X(C23H24O2S)]
method: RPBEPBE
basis: SDD
operation: Freq
keyword: #p
keyword: freq=noraman
keyword: PBEPBE/SDD
title: #p freq=noraman PBEPBE/SDD
converged: NO YES NO NO
title: Mulliken charges:
elementType: S O O C C C C C C C C C C C C C C C C C C C C C C C H H H H H H H H H H H H H H H H H H H H H H H H
charge: 0.623982 -0.437206 -0.621948 -0.254413 -0.676139 -0.115926 0.479033 0.511565 -0.715902 -0.393666 -0.461868 -0.149789 -0.348575 -0.434985 -0.241183 -0.229248 -0.240432 -0.234994 -0.249071 -0.233870 -0.248279 -0.244465 -0.374061 -0.376717 0.445817 -0.803370 0.296735 0.345568 0.226721 0.235051 0.207991 0.247047 0.239902 0.282624 0.269041 0.251021 0.335638 0.224032 0.226527 0.229684 0.228580 0.300602 0.255437 0.226910 0.230263 0.236279 0.237392 0.239011 0.226162 0.227488
chargesum: 0.00000
title: Mulliken charges with hydrogens summed into heavy atoms:
elementType: S O O C C C C C C C C C C C C C C C C C C C C C C C
charge: 0.623982 -0.101568 -0.621948 0.042322 -0.330571 0.110795 0.479033 0.511565 -0.025813 -0.153764 -0.179244 -0.149789 -0.079534 -0.183964 -0.017150 -0.002722 -0.010748 -0.006414 0.051532 0.021567 -0.021369 -0.014202 -0.137782 -0.139325 0.445817 -0.110709
polarizability: 3.41210582e+02 -1.88572138e+01 2.81182630e+02 3.35126145e+01 2.06844016e+01 2.06965528e+02
1716.lowfreq: -31.6153 -4.4959 -0.0012 0.0011 0.0017 5.8970 7.6105 8.2627 20.9999
frequency: -31.4854 8.1803 20.9351 37.2573 46.0537 47.3507 52.0116 67.7106 77.8732 82.1806 101.4138 112.2232 138.5152 162.7227 182.3364 209.9314 227.3227 236.8809 248.1764 260.6114 275.6181 302.8885 323.5723 342.1939 346.5046 363.3448 405.6916 405.8581 407.4511 417.1856 423.6623 440.2985 481.5433 489.5105 502.6985 544.7829 575.6168 583.8303 611.1974 616.3406 627.1310 630.6333 677.8021 707.1029 712.9452 715.0324 752.8291 770.6756 779.1496 784.3239 788.0352 823.7424 844.8743 857.2257 857.8571 860.7330 864.0217 914.7960 926.3466 942.4658 958.9762 981.7236 985.2184 986.0778 986.6681 989.5602 991.4718 997.8205 999.2989 1000.5753 1004.4799 1016.8747 1028.2637 1034.1210 1047.5105 1051.9355 1075.0990 1082.5703 1091.1590 1115.6734 1116.4005 1158.6511 1172.1182 1172.8447 1182.5793 1192.5791 1193.3314 1201.8430 1210.9380 1216.7477 1247.1622 1267.2245 1295.4748 1297.1057 1312.7079 1333.0047 1352.9295 1362.7631 1373.2329 1373.5646 1382.5856 1386.4896 1392.5692 1395.7880 1397.3228 1440.6328 1446.6386 1467.9088 1471.2564 1472.2530 1473.4455 1476.3306 1481.5559 1484.8191 1583.9682 1588.0749 1589.0803 1601.6067 1606.7822 1611.7289 2859.1518 2977.2679 2978.9112 3037.5411 3053.3326 3058.8416 3078.0129 3087.7013 3101.1804 3116.6894 3119.5938 3120.3677 3120.9447 3124.3285 3128.5834 3132.5462 3137.8026 3141.1759 3143.5549 3148.2362 3153.2984 3160.3004 3165.7322 3531.7285
redmass: 1.0176 5.2590 5.2137 5.0893 4.7262 3.9065 3.9987 3.1857 5.3014 4.0164 5.7903 4.5397 4.6965 5.6758 5.0600 4.5919 1.2273 5.5374 4.6821 4.5634 3.8887 5.3510 2.7709 4.1076 3.7615 1.5035 2.8939 3.0282 2.9263 4.5157 3.7107 3.4325 3.6045 3.5860 2.9036 4.2008 5.0210 5.6368 5.8699 6.3868 6.9240 4.8726 4.5621 1.7292 1.7164 2.8644 4.1137 2.0211 4.6226 10.3552 2.4957 1.3565 2.7350 1.9334 1.5534 1.2899 1.3273 1.8962 1.4152 1.7035 1.3256 1.3816 1.4267 1.8024 2.9440 4.8103 1.3456 1.5029 2.9591 2.0719 2.2544 1.5597 2.1772 2.0793 1.5799 2.5328 1.6310 1.6588 2.7266 1.3114 1.8887 1.2624 1.0575 1.0601 1.1568 1.1253 1.1194 1.9786 1.3538 2.8914 2.0335 1.7028 1.2733 1.4120 1.4955 1.2480 1.2795 2.1142 5.1354 1.3580 4.6776 1.2240 3.2719 2.3168 1.2228 2.1475 2.0044 1.0510 1.0934 1.0495 1.0549 2.3852 2.2725 2.2757 5.7624 6.6744 5.8578 6.0959 5.9788 5.9655 1.0816 1.0386 1.0388 1.0856 1.0849 1.0950 1.0963 1.0999 1.0995 1.0865 1.0873 1.0874 1.0859 1.0879 1.0876 1.0916 1.0961 1.0926 1.0960 1.0969 1.0958 1.1014 1.1010 1.0656
irintensity: 0.5400 0.0573 1.3172 0.7424 0.5145 0.2584 0.2279 2.1941 0.3083 0.2127 3.8959 0.8822 0.7349 8.0380 2.1223 3.1938 2.6649 2.3483 2.8852 11.0389 2.1529 3.5095 12.8167 9.6873 27.1357 127.9261 0.6681 2.2336 0.5795 9.6008 8.7491 9.2446 44.9465 16.0020 13.3119 9.5420 11.4823 1.3466 8.9241 0.3286 0.5833 16.3399 6.1545 39.5910 88.8687 15.4589 2.8781 11.9097 0.7062 28.8568 38.6818 45.3858 20.1626 4.8965 3.3765 4.8620 0.5082 5.4074 0.1080 3.5519 2.5191 0.1893 1.8216 0.4826 1.2731 0.2610 3.2717 1.4899 1.5861 12.1630 25.0692 52.0087 3.0810 2.2754 22.8706 6.3177 16.7383 10.3914 1.3886 12.7076 68.7711 5.2433 0.1419 0.1511 12.4729 1.3719 0.1557 3.0948 6.1152 3.9964 2.8226 6.8740 2.6896 10.3519 3.5219 4.9847 20.6973 4.2523 0.2154 18.2187 2.0506 19.0742 5.3402 0.4519 12.2241 6.8279 12.2743 11.1388 14.2762 9.3501 12.9137 44.0582 15.1673 19.8986 1.1733 0.8604 1.9879 1.7595 2.6323 8.0710 23.5656 37.9068 19.0358 8.9199 9.8324 20.0576 29.6859 15.9666 23.1649 1.2553 7.9686 2.5086 2.6663 9.4559 0.8778 8.7506 26.4045 19.7794 33.2147 9.5691 30.1434 32.1644 16.5274 5.7070
temp: 298.150 k
press: 1.00000 atm
elementType: 16 8 8 6 6 6 6 6 6 6 6 6 6 6 6 6 6 6 6 6 6 6 6 6 6 6 1 1 1 1 1 1 1 1 1 1 1 1 1 1 1 1 1 1 1 1 1 1 1 1
symmnumber: 1
zpe: 1058115.8 jmol-1
zpe.correction: 0.403015 hartree
zpe.thermalcorrener: 0.427659 hartree
zpe.thermalcorrenthalpy: 0.428603 hartree
zpe.thermalcorrgfe: 0.345698 hartree
zpe.sumelectzpe: -1437.413729 hartree
zpe.sumelectthermal: -1437.389085 hartree
zpe.sumelectthermalent: -1437.388141 hartree
zpe.sumelectthermalfe: -1437.471046 hartree
dipole: 1.0480 2.6618 1.1293
dipole: 3.0755
quadrupole: -137.0831 -152.1241 -166.7972
quadrupole: -1.6598 4.8271 -3.9677
quadrupole: 14.9184 -0.1226 -14.7957 -1.6598 4.8271 -3.9677
hfenergy: -1437.8167439 hartree
pointgroup: C01 [X(C23H24O2S1)]
dipole: 0.5370228 -1.0199559 -0.3679038 debye
polarizability: 327.6466|22.7348446|290.5554162|-48.5367225|3.7981265|211.1567244 unknown
InChI: InChI=1S/C23H24O2S/c1-17-13-15-21(16-14-17)26(25)23(20-11-7-4-8-12-20)22(18(2)24)19-9-5-3-6-10-19/h3-16,18,22-24H,1-2H3
charge 0 multiplicity 1
50 atoms
S  0.692514 0.834111 1.329984
O  -0.534111 1.300896 -2.818417
O  0.218293 2.444039 1.203486
C  -1.469757 0.798822 -0.559202
C  -0.190108 -0.03382 -0.318414
C  -1.753855 0.866083 -2.099651
C  -2.685847 0.395231 0.269469
C  -0.21945 -1.51681 -0.092652
C  -2.932388 1.79284 -2.442015
C  -3.511778 -0.70433 -0.085504
C  -3.008445 1.136855 1.436789
C  2.45081 0.843624 0.63016
C  -0.824473 -2.114852 1.048702
C  0.408288 -2.36205 -1.04983
C  -4.63309 -1.049684 0.700705
C  -4.126421 0.788124 2.228875
C  -0.811851 -3.516238 1.214972
C  0.410753 -3.765079 -0.887899
C  2.957001 2.080271 0.196967
C  3.220484 -0.33537 0.592332
C  -4.945007 -0.305383 1.862624
C  -0.199848 -4.347694 0.247121
C  4.275773 2.132154 -0.305282
C  4.537227 -0.262867 0.083008
C  5.085253 0.967039 -0.368429
C  6.515117 1.040479 -0.875576
H  -1.182011 1.835682 -0.252158
H  0.528277 0.234435 -1.111748
H  -1.929352 -0.146223 -2.504945
H  -3.046347 1.860469 -3.5379
H  -2.757932 2.810772 -2.04106
H  -3.876506 1.421038 -2.009894
H  -3.276454 -1.303248 -0.973085
H  -2.369089 1.982699 1.719235
H  -1.301707 -1.484509 1.805961
H  0.887028 -1.909872 -1.927008
H  -0.360404 2.24981 -2.582998
H  -5.259667 -1.900899 0.410193
H  -4.359605 1.371794 3.12687
H  -1.280725 -3.96058 2.100146
H  0.892029 -4.399592 -1.640631
H  2.312967 2.965751 0.266809
H  2.812755 -1.291345 0.939645
H  -5.814883 -0.573749 2.473043
H  -0.194683 -5.435594 0.378844
H  4.684226 3.0902 -0.649416
H  5.14589 -1.174108 0.039466
H  7.218482 1.246116 -0.045238
H  6.82983 0.091346 -1.343836
H  6.640397 1.847618 -1.618418
