program: Gaussian 09
title: 000288392
version: EM64L-G09RevD.01
frameworkgroup: C1[X(C6H2N4O4S)]
method: RPBEPBE
basis: SDD
operation: Freq
keyword: #p
keyword: freq=noraman
keyword: PBEPBE/SDD
title: #p freq=noraman PBEPBE/SDD
converged: NO YES NO NO
title: Mulliken charges:
elementType: S O O O O N N N N C C C C C C H H
charge: 0.577241 -0.164472 -0.164135 -0.163589 -0.163677 0.027194 0.027087 -0.381747 -0.381640 0.336525 0.336856 0.152364 0.152064 -0.408731 -0.408783 0.313786 0.313657
chargesum: 0.00000
title: Mulliken charges with hydrogens summed into heavy atoms:
elementType: S O O O O N N N N C C C C C C
charge: 0.577241 -0.164472 -0.164135 -0.163589 -0.163677 0.027194 0.027087 -0.381747 -0.381640 0.336525 0.336856 0.152364 0.152064 -0.094945 -0.095127
polarizability: 2.15858522e+02 5.40137286e-03 1.30209607e+02 -1.68051051e-02 1.18593680e+01 6.00781089e+01
1716.lowfreq: -3.6596 0.0010 0.0011 0.0021 5.1459 5.9539 43.4205 79.7190 91.2772
frequency: 43.4184 79.7157 91.2765 95.1284 175.8738 179.5457 239.6892 266.1437 308.8242 316.1429 364.1171 402.6216 407.1457 499.8368 540.7237 563.0568 610.0628 614.7021 639.2803 643.7438 714.7739 716.3731 727.0707 737.0676 753.1594 755.4389 837.3529 904.4693 919.0471 1003.4410 1092.2573 1205.2590 1214.3761 1225.8533 1237.6984 1279.7063 1347.7679 1387.3525 1396.8800 1441.4112 1462.2584 1529.3639 1600.7841 3192.8746 3194.9226
redmass: 16.0054 9.6536 15.7941 12.8236 13.9572 15.6459 13.0730 8.6823 12.5760 16.4086 9.5519 9.6555 4.7561 5.4150 11.0693 11.0812 13.4403 11.3424 9.0629 9.4234 7.2242 13.6003 5.9454 6.6210 12.1048 10.5887 4.6651 1.4783 1.4625 9.9509 2.2862 11.0127 12.5635 1.6414 3.6840 10.3597 2.6721 14.4224 13.9346 11.3769 6.2777 10.3081 8.1973 1.0935 1.0937
irintensity: 0.0094 0.1115 0.0914 2.5819 3.5244 1.0440 1.9261 0.0232 0.7837 0.4988 11.3207 0.7123 16.1476 0.1378 7.4300 5.7505 3.9820 7.2843 0.3940 7.2574 8.7679 12.5126 18.8913 1.3194 12.8108 38.9440 1.5381 5.5775 40.5127 0.0292 13.2709 70.7546 283.4431 0.7352 1.1390 4.5230 1.7256 282.1265 1.7635 14.5717 0.7914 9.5395 1.4223 17.1552 0.5876
temp: 298.150 k
press: 1.00000 atm
elementType: 16 8 8 8 8 7 7 7 7 6 6 6 6 6 6 1 1
symmnumber: 1
zpe: 233020.6 jmol-1
zpe.correction: 0.088753 hartree
zpe.thermalcorrener: 0.100763 hartree
zpe.thermalcorrenthalpy: 0.101707 hartree
zpe.thermalcorrgfe: 0.049236 hartree
zpe.sumelectzpe: -1146.515946 hartree
zpe.sumelectthermal: -1146.503936 hartree
zpe.sumelectthermalent: -1146.502992 hartree
zpe.sumelectthermalfe: -1146.555463 hartree
dipole: -5.7043 -0.0038 0.0064
dipole: 5.7043
quadrupole: -104.3420 -99.5838 -92.3409
quadrupole: 0.0001 -0.0228 -2.5255
quadrupole: -5.5865 -0.8282 6.4147 0.0001 -0.0228 -2.5255
hfenergy: -1146.6046992 hartree
pointgroup: C01 [X(C6H2N4O4S1)]
dipole: -2.2442443 0.0018121 -0.0022745 debye
dipolederiv: -0.1143936 -0.0000879 0.00021 0.000993 0.2261996 -0.0033458 -0.0025794 -0.0161536 0.306772 -0.4204409 0.1546771 -0.0253142 0.2458221 -0.5884319 -0.2793709 -0.0098854 -0.1956427 -0.4191989 -0.4206609 -0.155433 0.0246482 -0.2457891 -0.5867344 -0.2794843 0.0097048 -0.1964252 -0.4208697 -0.637442 0.0042964 -0.2454646 0.133202 -0.4067725 -0.1325034 -0.1103736 -0.1811741 -0.4557312 -0.6368271 -0.0051036 0.2459226 -0.1337238 -0.4058715 -0.1325293 0.1093645 -0.1808923 -0.4574368 1.2041672 -0.3467666 0.3091831 -0.5859981 0.8789471 0.4526274 0.0702719 0.3981606 0.7465603 1.2025666 0.3478399 -0.3086708 0.5858153 0.8760836 0.4526901 -0.0692295 0.3985129 0.7503773 0.1114897 0.0146479 0.0022444 -0.3153282 -0.1232626 0.0279582 -0.0569125 0.0295953 -0.258649 0.1102029 -0.014814 -0.0019078 0.3145502 -0.1235539 0.0300614 0.0611476 0.0300627 -0.2581961 -0.3844232 0.1209633 -0.0108057 -0.0109147 0.1406568 -0.0525372 0.0939521 0.0018571 -0.0027572 -0.3814158 -0.1201424 0.0104575 0.0109187 0.1412332 -0.0524289 -0.0930277 0.0011505 -0.0030773 -0.0998963 0.055057 0.0132866 -0.1029061 -0.1100684 -0.0427425 0.0007177 -0.0430566 0.0957645 -0.098256 -0.0545627 -0.0139106 0.103336 -0.1096807 -0.0435026 -0.002182 -0.0440798 0.0955377 0.182591 -0.082296 -0.0199447 -0.013552 -0.0016904 0.0295874 0.0948305 -0.0054835 -0.0301257 0.180249 0.0816892 0.0199583 0.0136277 -0.0014851 0.0297357 -0.095291 -0.0047014 -0.0301687 0.1013013 0.0019735 0.0074651 0.026488 0.0973584 -0.0020891 -0.0413914 0.0042069 0.1706285 0.1011881 -0.0019381 -0.0073574 -0.0265413 0.0970726 -0.0021261 0.0408833 0.0040632 0.1705703 unknown
polarizability: 215.8585223|-0.0066305|125.3773344|0.0146797|21.3585637|64.9103808 unknown
InChI: InChI=1S/C6H2N4O4S/c11-9(12)5-1-3-4(8-15-7-3)2-6(5)10(13)14/h1-2H
charge 0 multiplicity 1
17 atoms
S  -4.177191 0.000626 -0.001478
O  2.028539 -2.525225 -0.795069
O  2.031734 2.521996 0.797549
O  2.772528 -1.120084 0.851837
O  2.771974 1.121526 -0.854718
N  1.915858 -1.498445 -0.03168
N  1.916341 1.498639 0.03052
N  -2.996987 -1.30867 -0.238929
N  -2.996721 1.308806 0.242478
C  0.649746 -0.715903 -0.107571
C  0.649882 0.716123 0.10629
C  -1.768939 -0.724685 -0.135082
C  -1.768843 0.725074 0.135712
C  -0.526825 -1.433711 -0.242995
C  -0.526526 1.433981 0.24295
H  -0.509057 -2.51484 -0.398499
H  -0.508812 2.51499 0.399188
