program: Gaussian 09
title: 000288470
version: EM64L-G09RevD.01
frameworkgroup: C1[X(C22H22O3S)]
method: RPBEPBE
basis: SDD
operation: Freq
keyword: #p
keyword: freq=noraman
keyword: PBEPBE/SDD
title: #p freq=noraman PBEPBE/SDD
converged: YES YES NO NO
title: Mulliken charges:
elementType: S O O O C C C C C C C C C C C C C C C C C C C C C C H H H H H H H H H H H H H H H H H H H H H H
charge: 0.781572 -0.420216 -0.425036 -0.575676 -0.230733 -0.750318 -0.318429 0.413351 0.593558 0.476921 -0.348261 -0.464875 -0.368541 -0.394838 -0.392135 -0.404962 -0.253136 -0.227799 -0.242042 -0.264713 -0.240312 -0.236513 -0.243892 -0.236488 -0.245659 -0.509567 0.286978 0.323359 0.278677 0.247856 0.262102 0.245306 0.252506 0.350256 0.230553 0.254061 0.231552 0.231754 0.230082 0.231354 0.232917 0.226432 0.229043 0.231528 0.229372 0.266471 0.232088 0.224491
chargesum: 0.00000
title: Mulliken charges with hydrogens summed into heavy atoms:
elementType: S O O O C C C C C C C C C C C C C C C C C C C C C C
charge: 0.781572 -0.069960 -0.425036 -0.575676 0.056245 -0.426958 -0.039751 0.413351 0.593558 0.476921 -0.100404 -0.202773 -0.123235 -0.142332 -0.161582 -0.150901 -0.021584 0.003954 -0.011960 -0.033359 -0.007395 -0.010081 -0.014849 -0.004960 -0.016287 0.213483
polarizability: 3.02265944e+02 -3.33062668e+01 2.69522369e+02 -2.19229686e+01 -2.64154850e+01 2.20188680e+02
1716.lowfreq: -5.6025 -0.0017 -0.0012 0.0008 9.3639 12.0765 23.4393 30.3548 33.2546
frequency: 23.2203 30.2368 33.1466 39.8461 50.1498 63.3103 67.3455 73.6523 77.6656 93.6587 109.7770 115.0470 154.5013 161.5308 190.2499 202.8268 210.2405 219.0546 223.7726 238.7782 267.8701 281.5402 335.5048 371.5952 376.4807 402.6963 405.6406 409.0560 426.8660 441.3510 454.0089 458.7271 495.8238 527.3344 542.3699 574.9768 608.4241 613.0860 615.7270 619.4724 621.9327 674.4764 700.5706 706.1223 711.9690 738.3772 765.3581 774.1853 783.1679 832.1667 849.1633 854.7746 861.5800 872.3903 874.9547 916.6438 924.3158 924.6576 934.8592 963.1042 976.3809 977.5474 979.9251 984.8631 989.4541 989.8189 991.9001 996.5637 997.9100 1001.4545 1026.4780 1029.1675 1031.4177 1065.7851 1081.9879 1085.5514 1087.9893 1103.9575 1124.2440 1132.0200 1172.6982 1174.5914 1175.2193 1178.1881 1191.7198 1193.8763 1196.5297 1199.6682 1219.4093 1234.6969 1249.3525 1267.1444 1313.7188 1325.7692 1333.0057 1346.1294 1373.5437 1375.1424 1389.5111 1393.0170 1399.2932 1421.3147 1438.9162 1441.9139 1449.1708 1453.3344 1466.4002 1483.6762 1484.6938 1487.0577 1586.4440 1589.9578 1592.1928 1610.1966 1610.4503 1612.2777 2915.9507 3014.0212 3028.8121 3052.2514 3054.1271 3078.0870 3120.5076 3124.2079 3126.3151 3127.6133 3129.2724 3133.5681 3139.1597 3141.1733 3145.2357 3149.8824 3151.2375 3154.2992 3164.2863 3166.3452 3167.2991 3502.6350
redmass: 4.8029 4.9027 5.4232 4.7549 4.2675 5.0318 4.5253 5.1271 4.6101 3.3876 7.8015 4.8206 2.2581 1.7011 5.8502 5.1394 5.7468 5.7754 4.8602 4.4504 4.8627 6.1594 8.8580 1.2512 3.4542 2.8510 2.8832 2.6126 10.0199 5.2513 5.1197 4.2048 3.6060 5.3548 3.7162 4.5516 4.5766 5.8012 6.3133 5.6415 5.6701 4.0641 1.6906 1.7115 1.6032 3.6865 2.0097 2.2155 2.1782 3.7781 1.2851 1.3044 1.2457 3.0956 10.4513 1.5361 9.7046 1.4218 1.5664 3.4847 1.8068 1.7748 1.6230 2.0004 5.8807 5.4073 3.7404 1.3693 1.3181 1.3320 2.4109 2.2258 2.1522 2.4334 1.6307 1.6060 1.2323 1.6968 1.3974 1.3409 1.1016 1.0676 1.0616 1.7681 1.7127 1.1793 1.1682 1.2910 1.3506 1.5159 1.4247 1.7229 1.4747 1.4322 1.3231 1.3537 2.4052 2.7104 5.7712 1.9700 1.9690 1.1097 2.0910 2.1371 1.8983 1.0768 1.0517 2.2241 2.2274 2.2452 5.8021 5.7046 5.9662 5.9071 5.9136 5.9668 1.0404 1.0826 1.0855 1.0847 1.0856 1.1060 1.0852 1.0858 1.0848 1.0871 1.0872 1.0878 1.0920 1.0918 1.0924 1.0955 1.0962 1.0961 1.1013 1.1015 1.1014 1.0656
irintensity: 0.3150 0.5149 0.1966 0.2874 0.1706 0.3662 0.5484 1.1317 0.5732 2.1237 1.2559 3.6379 0.9468 2.0024 1.5471 0.3022 7.0112 1.1288 16.2276 0.7804 0.1149 2.1582 8.4156 133.0107 18.2620 0.3950 1.1092 12.7898 29.8974 0.0783 4.1446 2.7671 1.1983 17.6738 13.0537 54.7892 1.2035 2.8201 0.7069 4.2942 2.2507 3.9281 58.8857 28.5886 94.4148 3.3040 7.7141 57.2710 5.9325 2.6490 3.6921 1.9053 0.3913 0.1310 52.3633 10.6907 52.7471 0.1344 4.2756 14.3900 28.2726 24.8092 14.6946 19.0853 0.3194 0.2723 3.7999 0.3109 0.1968 1.4232 2.3127 8.0601 5.9324 2.0042 13.1059 5.1654 1.3299 0.5351 3.4855 1.8396 1.3347 0.2260 0.1859 7.8788 0.7474 1.5600 2.5812 1.9239 35.5260 17.5494 14.8556 17.7987 3.2856 2.7222 4.4566 3.0934 4.4934 5.5882 0.3275 10.2178 1.1049 11.1084 9.1183 19.0978 2.3219 18.0659 8.1892 9.7536 11.9930 13.2203 1.0370 1.8947 0.3744 0.2219 2.8932 3.2622 34.5553 2.8930 40.9346 3.5344 17.0794 31.9621 2.5554 3.2751 1.5459 0.2783 0.0818 2.6095 17.6801 15.5320 23.7384 31.0594 29.0893 24.6948 22.8472 21.4317 15.9933 17.6322
temp: 298.150 k
press: 1.00000 atm
elementType: 16 8 8 8 6 6 6 6 6 6 6 6 6 6 6 6 6 6 6 6 6 6 6 6 6 6 1 1 1 1 1 1 1 1 1 1 1 1 1 1 1 1 1 1 1 1 1 1
symmnumber: 1
zpe: 997459.8 jmol-1
zpe.correction: 0.379912 hartree
zpe.thermalcorrener: 0.404848 hartree
zpe.thermalcorrenthalpy: 0.405792 hartree
zpe.thermalcorrgfe: 0.323126 hartree
zpe.sumelectzpe: -1473.308427 hartree
zpe.sumelectthermal: -1473.283491 hartree
zpe.sumelectthermalent: -1473.282547 hartree
zpe.sumelectthermalfe: -1473.365213 hartree
dipole: 1.2213 0.3206 -0.4340
dipole: 1.3352
quadrupole: -143.2064 -154.4567 -165.9495
quadrupole: -12.6434 -13.9816 -11.9125
quadrupole: 11.3311 0.0809 -11.4119 -12.6434 -13.9816 -11.9125
hfenergy: -1473.688339 hartree
pointgroup: C01[X(C22H22O3S1)]
dipole: 0.4717058 0.1622957 -0.1645983 debye
polarizability: 309.2178493|-29.6204112|260.7311463|-15.2682137|-31.2382133|222.0279977 unknown
InChI: InChI=1S/C22H22O3S/c1-25-26(24)22(19-15-9-4-10-16-19)20(17-11-5-2-6-12-17)21(23)18-13-7-3-8-14-18/h2-16,20-23H,1H3
charge 0 multiplicity 1
48 atoms
S  -1.247172 -2.169807 -1.135586
O  1.433634 0.442964 2.657926
O  -2.117164 -2.762183 0.47479
O  -2.445806 -1.866266 -2.209945
C  0.199745 -0.553139 0.754854
C  -0.77938 -0.296611 -0.397667
C  0.703718 0.792548 1.434462
C  1.382592 -1.444139 0.367143
C  -2.070413 0.396856 -0.11976
C  1.4963 1.723134 0.513861
C  2.151016 -1.218612 -0.806734
C  1.756289 -2.511155 1.227432
C  -2.752192 1.029077 -1.196147
C  -2.682094 0.392128 1.165293
C  2.912093 1.751796 0.529985
C  0.807517 2.59696 -0.368123
C  3.254866 -2.042926 -1.113284
C  2.866042 -3.333815 0.924824
C  -3.999269 1.657125 -0.992287
C  -3.925322 1.024738 1.369355
C  3.619136 -3.101357 -0.248234
C  3.626262 2.611968 -0.334267
C  1.519115 3.455813 -1.235314
C  -4.588637 1.661068 0.292459
C  2.933382 3.462398 -1.22616
C  -3.567991 -2.90399 0.288859
H  -0.353335 -1.074479 1.559904
H  -0.287396 0.107921 -1.299283
H  -0.186683 1.330239 1.801523
H  1.898151 -0.393005 -1.48087
H  1.150399 -2.716597 2.118139
H  -2.303449 1.018126 -2.195498
H  -2.193735 -0.114232 2.004265
H  2.099447 -0.261595 2.43885
H  3.462053 1.119189 1.234506
H  -0.28906 2.621989 -0.363137
H  3.833727 -1.856866 -2.024712
H  3.132983 -4.157123 1.596576
H  -4.512065 2.136583 -1.833215
H  -4.379599 1.021771 2.366468
H  4.476004 -3.740229 -0.488993
H  4.721738 2.622847 -0.305983
H  0.971305 4.12758 -1.905902
H  -5.554613 2.152457 0.454036
H  3.48699 4.132152 -1.893746
H  -3.869553 -2.558657 -0.725929
H  -4.080696 -2.274817 1.037404
H  -3.839783 -3.968324 0.408059
