program: Gaussian 09
title: 000288518
version: EM64L-G09RevD.01
frameworkgroup: C1[X(C23H21N3O4)]
method: RPBEPBE
basis: SDD
operation: Freq
keyword: #p
keyword: freq=noraman
keyword: PBEPBE/SDD
title: #p freq=noraman PBEPBE/SDD
converged: YES YES NO NO
title: Mulliken charges:
elementType: O O O O N N N C C C C C C C C C C C C C C C C C C C C C C C H H H H H H H H H H H H H H H H H H H H H
charge: -0.231646 -0.259604 -0.203350 -0.203843 -0.138975 -0.156397 0.025224 -0.283662 -0.383114 -0.289807 0.468973 0.420655 0.089078 -0.380692 -0.366603 0.269046 -0.344147 -0.405891 -0.241783 -0.238340 -0.432944 -0.342456 0.442230 -0.237868 -0.295744 -0.352199 -0.379594 -0.358268 -0.808391 0.384565 0.258352 0.271816 0.249041 0.226490 0.223761 0.276033 0.233143 0.239421 0.264509 0.231138 0.229901 0.231796 0.229688 0.232869 0.294688 0.274173 0.293975 0.289983 0.226526 0.233339 0.224911
chargesum: 0.00000
title: Mulliken charges with hydrogens summed into heavy atoms:
elementType: O O O O N N N C C C C C C C C C C C C C C C C C C C C C C C
charge: -0.231646 -0.259604 -0.203350 -0.203843 -0.138975 -0.156397 0.025224 -0.025310 0.137743 0.160444 0.468973 0.420655 0.089078 -0.104660 -0.133461 0.269046 -0.104726 -0.141382 -0.010646 -0.008439 -0.201148 -0.112769 0.442230 -0.004999 -0.001056 -0.078026 -0.085620 -0.068286 -0.123615 0.384565
polarizability: 3.24055568e+02 8.47992161e+00 3.28171285e+02 -2.81353928e+01 4.52590755e+00 2.29848105e+02
1716.lowfreq: -19.8436 -10.6753 -7.0280 -4.8072 -0.0006 -0.0005 0.0004 11.2446 14.3213
frequency: -19.4272 10.7928 14.1689 25.5058 30.8617 37.2622 45.7842 51.5911 73.6381 79.6354 99.9557 111.4229 141.0735 141.8721 167.9170 200.5074 225.2171 239.7015 264.5280 271.1039 277.3178 289.6381 306.7716 333.8479 353.0983 389.0925 397.7197 400.9310 404.2501 410.9222 437.6769 458.4134 466.1846 490.7875 499.7888 512.2780 519.5850 547.7118 581.7386 614.3434 619.8945 634.8321 638.7808 664.1773 676.4089 693.4842 700.9675 705.4629 724.3620 740.1302 758.7252 772.1345 781.2973 794.9995 802.2883 830.6799 840.5244 848.9781 851.0195 860.0476 868.7081 883.7439 916.9259 926.6563 933.1701 965.7222 974.9172 981.8808 984.7399 990.6850 991.7305 998.3314 1001.5880 1004.4886 1007.9907 1009.8544 1025.5889 1040.1333 1046.6234 1080.1583 1090.8423 1091.7355 1110.1319 1129.9315 1140.8933 1161.5832 1174.9823 1181.9400 1190.4845 1196.7997 1197.4121 1218.5117 1221.9741 1227.2674 1253.1612 1257.9618 1286.8504 1298.7909 1313.7849 1321.2359 1331.2500 1339.3129 1345.0817 1362.3307 1366.3272 1383.7443 1395.0440 1397.5412 1401.3268 1409.9504 1418.3148 1437.2015 1437.5669 1461.0088 1469.7877 1474.7367 1476.4148 1483.3522 1502.3594 1550.6652 1577.1439 1590.5503 1594.1024 1605.1294 1611.5786 1624.0925 2973.5596 3003.7086 3019.0967 3051.6192 3052.3094 3081.9034 3093.5072 3101.1603 3117.6990 3121.9697 3124.1851 3131.8610 3137.2622 3145.2539 3152.6751 3161.7678 3162.3539 3179.4707 3180.8001 3183.8403 3187.4124
redmass: 1.0533 4.1351 5.2897 5.8118 6.5316 5.1550 4.1003 10.3973 5.9295 4.8738 4.8270 4.5475 4.4459 6.2684 7.1784 4.2175 5.1520 8.0573 5.3815 5.6498 4.0412 4.3370 4.9275 3.5821 4.4965 4.0319 3.2169 3.3870 2.9529 3.1290 4.1340 6.7639 4.1646 4.0363 6.6738 3.5097 3.4586 4.7306 3.9647 6.3682 6.9175 6.8557 5.3516 6.5854 5.5917 4.4172 2.1220 3.1718 2.5527 3.5753 4.5570 3.2871 5.0807 5.0533 1.4761 1.3748 4.0746 1.7470 1.8815 1.3917 2.3296 1.9316 2.0379 2.5560 1.3203 1.3529 1.4097 1.5118 2.7337 5.1593 1.4256 1.3650 1.6911 2.4239 2.7651 2.8162 2.7335 3.2103 1.5389 2.2832 2.4237 1.9319 1.3218 1.4045 2.0838 4.3678 1.0532 1.3714 2.9419 1.1408 1.1429 5.2120 1.2694 2.8409 2.0148 1.5946 1.5264 1.2863 1.4553 1.4844 1.2946 1.4333 1.3400 6.5033 5.1752 7.2872 10.9191 1.2338 2.7642 3.7705 3.2772 1.1056 2.1943 1.1050 1.0482 1.1025 2.4477 2.1848 2.6686 9.7172 6.1060 7.7503 6.0955 6.3437 5.9029 6.3755 1.0377 1.0613 1.0615 1.0967 1.0825 1.0989 1.1008 1.1054 1.0874 1.0893 1.0893 1.0872 1.0922 1.0933 1.0949 1.0902 1.0986 1.0938 1.0961 1.0943 1.0962
irintensity: 0.2683 0.2631 0.3200 0.1106 0.0895 0.1687 0.5017 1.6146 0.9360 0.9506 0.6285 3.1947 0.6724 2.7441 6.1352 3.1021 2.4326 2.3350 5.3361 2.3020 1.7091 1.4793 7.5071 5.3930 4.8302 17.2168 1.4803 1.6626 0.5686 0.8626 5.2531 13.0644 2.2772 18.7300 3.3926 37.7585 16.6585 17.7616 12.7119 0.1728 0.6386 0.7540 18.4589 0.3449 27.5192 39.5274 46.4755 1.0891 21.5915 29.2496 5.5646 38.7026 10.9585 9.1868 44.8682 26.7122 21.6344 5.9540 8.5087 11.1058 7.2709 46.3208 8.5154 32.5897 1.1503 0.2276 1.4457 11.6709 81.6909 0.2053 0.0485 2.4162 5.4365 38.5959 3.5885 20.1614 18.3563 28.7184 11.1774 28.3217 19.4078 0.1907 16.2592 4.5065 38.2222 13.1309 0.0746 51.7335 54.6357 1.3476 4.8524 365.8033 2.0433 1.0339 94.0303 62.5585 81.5339 1.8804 17.3112 18.8635 15.9865 31.7517 1.9498 70.6055 2.0201 2.5860 13.2813 7.8429 143.5819 79.7768 2.3311 12.0414 23.7288 36.3914 12.2805 13.2605 8.5905 15.5419 150.0760 291.3198 2.0589 13.0315 1.2166 10.6779 2.3529 16.1273 50.5080 50.5490 26.1816 21.8229 3.0007 17.6733 15.7514 11.1929 8.5925 13.3695 30.3557 1.2525 0.5589 24.2238 16.9214 1.0588 30.0957 2.5082 5.1179 1.1096 2.1927
temp: 298.150 k
press: 1.00000 atm
elementType: 8 8 8 8 7 7 7 6 6 6 6 6 6 6 6 6 6 6 6 6 6 6 6 6 6 6 6 6 6 6 1 1 1 1 1 1 1 1 1 1 1 1 1 1 1 1 1 1 1 1 1
symmnumber: 1
zpe: 1034608.7 jmol-1
zpe.correction: 0.394062 hartree
zpe.thermalcorrener: 0.419501 hartree
zpe.thermalcorrenthalpy: 0.420446 hartree
zpe.thermalcorrgfe: 0.334454 hartree
zpe.sumelectzpe: -1351.941070 hartree
zpe.sumelectthermal: -1351.915630 hartree
zpe.sumelectthermalent: -1351.914686 hartree
zpe.sumelectthermalfe: -1352.000678 hartree
dipole: 5.8192 -1.5670 0.3316
dipole: 6.0356
quadrupole: -198.2137 -174.1410 -167.7670
quadrupole: 11.8136 -0.1657 -9.6557
quadrupole: -18.1732 5.8996 12.2735 11.8136 -0.1657 -9.6557
hfenergy: -1352.3351316 hartree
pointgroup: C01 [X(C23H21N3O4)]
dipole: 1.8337048 1.193896 -0.9223971 debye
polarizability: 335.7792866|-2.1989364|319.8950404|8.0282284|-20.3734361|226.4006307 unknown
InChI: InChI=1S/C23H21N3O4/c1-17-7-11-20(12-8-17)25-22(18-5-3-2-4-6-18)24(15-16-30-25)23(27)19-9-13-21(14-10-19)26(28)29/h2-14,22H,15-16H2,1H3
charge 0 multiplicity 1
51 atoms
O  2.407056 1.952133 0.874235
O  -2.354313 2.784097 1.582723
O  -3.535549 -4.367984 1.870212
O  -5.423601 -3.479758 0.94788
N  -0.406818 2.020062 0.563621
N  1.575444 0.70893 0.699459
N  -4.207879 -3.384551 1.372183
C  0.404843 1.007886 -0.160717
C  0.315955 3.279813 0.843347
C  1.58823 2.926155 1.637706
C  0.68148 1.460819 -1.609197
C  2.411241 -0.42649 0.46901
C  -1.68115 1.824626 1.086174
C  1.985213 1.602957 -2.139779
C  -0.437457 1.694786 -2.449354
C  -2.273735 0.432613 1.083714
C  1.983306 -1.512658 -0.341646
C  3.658655 -0.523894 1.144093
C  2.163557 1.969245 -3.493818
C  -0.259085 2.061877 -3.799888
C  2.776647 -2.676365 -0.438323
C  4.442401 -1.685391 1.015776
C  4.017938 -2.792543 0.233181
C  1.046445 2.199632 -4.327449
C  -1.57855 -0.679724 1.631418
C  -3.62161 0.282625 0.666257
C  -2.211226 -1.93348 1.736615
C  -4.260097 -0.968208 0.745863
C  4.863592 -4.049591 0.129135
C  -3.540179 -2.06085 1.279014
H  -0.188953 0.080032 -0.203702
H  -0.354595 3.939155 1.418193
H  0.584162 3.774856 -0.107365
H  2.254245 3.798188 1.751249
H  1.332147 2.498721 2.625318
H  2.856829 1.436232 -1.502446
H  -1.452122 1.595804 -2.043209
H  1.051242 -1.4629 -0.91319
H  4.001321 0.317634 1.750886
H  3.177462 2.076381 -3.89486
H  -1.131781 2.239245 -4.438054
H  2.424446 -3.503936 -1.065865
H  5.404647 -1.735695 1.540538
H  1.189587 2.48323 -5.3760
H  -0.552745 -0.558261 1.997345
H  -4.163092 1.159523 0.298688
H  -1.699626 -2.801357 2.160262
H  -5.292835 -1.112767 0.418702
H  5.9190 -3.810506 -0.097734
H  4.85667 -4.619453 1.078484
H  4.492037 -4.722197 -0.663187
