program: Gaussian 09
title: 000288344
version: EM64L-G09RevD.01
frameworkgroup: C1[X(C7H5Cl4N)]
method: RPBEPBE
basis: SDD
operation: Freq
keyword: #p
keyword: freq=noraman
keyword: PBEPBE/SDD
title: #p freq=noraman PBEPBE/SDD
converged: NO YES NO NO
title: Mulliken charges:
elementType: Cl Cl Cl Cl N C C C C C C C H H H H H
charge: 0.001671 -0.013985 -0.002719 -0.004239 -0.433580 0.784950 -0.286408 -0.328254 -0.068588 -0.048135 -0.307909 -0.608457 0.311554 0.289535 0.249764 0.215162 0.249637
chargesum: 0.00000
title: Mulliken charges with hydrogens summed into heavy atoms:
elementType: Cl Cl Cl Cl N C C C C C C C
charge: 0.001671 -0.013985 -0.002719 -0.004239 -0.122026 0.784950 -0.286408 -0.328254 -0.068588 -0.048135 -0.018374 0.106106
polarizability: 1.68090994e+02 -1.66824162e+00 1.55110544e+02 1.43193059e-02 -5.71203859e-02 4.85178023e+01
1716.lowfreq: -40.0450 -0.0011 -0.0010 0.0015 0.6268 4.5091 6.1095 66.4998 99.7827
frequency: -40.0362 66.4996 99.7787 142.9638 186.9402 193.9894 206.5224 217.0093 249.5152 266.6118 301.4709 314.7568 321.3329 351.0657 431.7872 513.3131 538.6812 556.5536 565.2645 565.6439 680.3977 722.3124 796.4612 803.1122 872.8577 1021.8703 1109.3646 1116.4010 1133.8953 1179.0363 1251.4212 1314.8138 1406.0094 1428.0304 1470.7834 1473.2043 1489.5659 1519.0033 1561.5271 1589.0028 2993.9619 3084.0974 3095.8453 3201.0967 3524.2422
redmass: 3.6329 21.2275 5.6594 8.1827 26.0576 9.0018 1.0449 22.2346 5.8238 5.5511 19.1140 18.8085 11.3304 6.0148 7.8737 1.3457 7.1597 8.6877 7.3187 3.1162 7.4214 6.9634 12.0112 1.5114 5.9884 7.7673 5.3657 1.2725 1.5993 1.5333 7.7139 4.6409 4.5772 1.9000 1.0428 1.7513 1.1591 2.6705 2.2672 5.5238 1.0336 1.1024 1.1011 1.0935 1.0755
irintensity: 1.8971 0.1746 0.0539 0.1357 0.2053 0.7532 0.3801 0.5096 1.7478 5.6813 0.0534 0.2954 1.1837 5.0308 2.7639 52.4068 19.9588 4.8198 16.8254 48.0081 34.8797 5.3285 1.5178 30.5985 57.7483 106.4501 8.8192 0.6021 40.0818 2.5455 5.6390 74.5181 23.1761 90.0258 15.3862 34.7741 5.0461 89.4915 16.9269 327.8645 71.4739 28.5388 20.6146 5.9874 58.6240
temp: 298.150 k
press: 1.00000 atm
elementType: 17 17 17 17 7 6 6 6 6 6 6 6 1 1 1 1 1
symmnumber: 1
zpe: 274710.5 jmol-1
zpe.correction: 0.104632 hartree
zpe.thermalcorrener: 0.116283 hartree
zpe.thermalcorrenthalpy: 0.117228 hartree
zpe.thermalcorrgfe: 0.065963 hartree
zpe.sumelectzpe: -2163.839139 hartree
zpe.sumelectthermal: -2163.827487 hartree
zpe.sumelectthermalent: -2163.826543 hartree
zpe.sumelectthermalfe: -2163.877808 hartree
dipole: -0.2670 3.0695 0.0140
dipole: 3.0811
quadrupole: -103.7597 -83.9170 -99.3985
quadrupole: -2.9991 -0.0236 0.0307
quadrupole: -8.0680 11.7748 -3.7068 -2.9991 -0.0236 0.0307
hfenergy: -2163.9437703 hartree
pointgroup: C01 [X(C7H5Cl4N1)]
dipole: 0.6323782 -1.0318692 -0.0693807 debye
dipolederiv: -0.6502207 -0.1028363 0.0900253 -0.0619102 -0.0901837 0.0094241 0.0899381 0.0156987 -0.0203588 -0.2159476 -0.2034928 0.0292188 -0.2644071 -0.5767866 0.0409398 0.0297652 0.0330881 -0.0178919 -0.7262021 -0.0238733 0.0945152 -0.0309852 -0.0791012 0.0046435 0.0946916 0.0033191 -0.0435865 -0.1630929 -0.2224344 0.0196685 -0.2265165 -0.6486977 0.0365396 0.0196506 0.036032 -0.0362101 -0.7316914 0.501636 0.0308868 0.7129263 -1.0966483 -0.0884575 0.0293234 -0.0630603 -0.4725859 0.1992102 -0.6633008 0.0123257 -0.8896393 0.9936129 0.1105827 0.0142389 0.0810795 0.2389102 0.7949425 -0.0959624 -0.1330192 0.5321432 -0.4332628 -0.0693674 -0.138654 0.0142233 -0.1453337 -0.2028819 0.8518323 -0.0014523 0.2993435 0.5236407 -0.0458572 0.0031436 -0.119655 -0.1504396 1.0713686 -0.2205075 -0.1417016 0.1855603 0.4066637 -0.029195 -0.1454255 0.0268129 0.0300983 0.4542943 0.3898791 -0.0640253 -0.0142851 1.0277068 -0.0074211 -0.0600817 -0.0626645 0.0124889 -0.6257189 -0.1191042 0.0670293 -0.1016179 -0.524288 0.0176655 0.067292 0.0199458 -0.1483218 0.612943 -0.257066 -0.0436495 -0.0780269 0.2266735 0.0103594 -0.0453184 0.0342107 0.2646803 0.1698169 0.0391635 0.0162306 -0.005152 0.2205618 0.0018163 0.0174091 -0.0042438 0.3016735 0.0653092 0.0110259 0.016325 0.0117169 0.0526355 -0.0004091 0.015931 -0.0006998 0.1834165 -0.0392949 0.0738093 0.0480573 -0.0655679 0.0900842 0.091866 0.097798 0.0208775 -0.0821991 0.0636868 -0.0230433 0.0087081 0.0861984 -0.1786504 -0.0067647 0.0069924 0.0077804 0.1268321 -0.076521 0.0642749 -0.0491428 -0.0897805 0.0860396 -0.0763649 -0.0966943 -0.0427444 -0.0411724 unknown
polarizability: 164.662666|4.0297588|156.3773678|-15.8057493|-1.6163377|50.6793065 unknown
InChI: InChI=1S/C7H5Cl4N/c1-12-7-5(10)3(8)2-4(9)6(7)11/h2,12H,1H3
charge 0 multiplicity 1
17 atoms
Cl 2.758243 0.804286 -0.471465
Cl -1.783143 -2.483526 0.181676
Cl -3.594952 0.195271 0.403572
Cl 0.8550 3.352839 -0.229819
N  1.106689 -1.974711 -0.211575
C  0.419046 -0.774807 -0.131775
C  0.975151 0.546299 -0.220648
C  -1.010489 -0.836237 0.062157
C  -1.805794 0.313231 0.159666
C  0.150416 1.687388 -0.118287
C  -1.239153 1.598297 0.071942
C  2.538765 -2.259107 -0.390305
H  0.504886 -2.796145 -0.126117
H  -1.856983 2.493818 0.148203
H  2.92949 -1.874649 -1.347604
H  2.653094 -3.356426 -0.38861
H  3.155034 -1.848521 0.42729
