program: Gaussian 09
title: 000288391
version: EM64L-G09RevD.01
frameworkgroup: C1[X(C16H20N2O2)]
method: RPBEPBE
basis: SDD
operation: Freq
keyword: #p
keyword: freq=noraman
keyword: PBEPBE/SDD
title: #p freq=noraman PBEPBE/SDD
converged: YES YES NO NO
title: Mulliken charges:
elementType: O O N N C C C C C C C C C C C C C C C C H H H H H H H H H H H H H H H H H H H H
charge: -0.264778 -0.252442 -0.127914 -0.490652 -0.095262 0.154871 0.141371 -0.498429 -0.393590 -0.458106 0.163359 0.191766 -0.636909 -0.490125 -0.431024 -0.373447 -0.254855 -0.224046 0.238450 -0.505381 0.211524 0.226598 0.207695 0.212252 0.194199 0.219341 0.226883 0.305570 0.229345 0.192339 0.228978 0.269623 0.268718 0.231538 0.230817 0.217914 0.219456 0.233710 0.240498 0.240146
chargesum: 0.00000
title: Mulliken charges with hydrogens summed into heavy atoms:
elementType: O O N N C C C C C C C C C C C C C C C C
charge: -0.264778 -0.252442 -0.127914 -0.185082 0.116262 0.154871 0.141371 -0.064136 0.012860 -0.011882 0.163359 0.191766 0.013753 0.048217 -0.199486 -0.142631 -0.036941 -0.004590 0.238450 0.208973
polarizability: 2.25675034e+02 -3.08548238e+01 2.00463552e+02 2.24551430e+01 1.41243873e+01 1.52362852e+02
1716.lowfreq: -10.9124 -0.0005 0.0004 0.0006 5.0186 8.3843 17.4130 23.7228 37.6157
frequency: 16.5578 23.6676 37.5913 59.8846 75.8262 98.9770 115.6522 137.2728 150.7498 170.0769 193.6375 203.6679 222.5076 267.9942 282.5045 289.7502 311.2847 341.8737 371.5671 386.9136 413.7257 431.9138 485.3337 498.6647 518.6440 530.1729 554.3437 575.6197 586.0344 594.2814 658.5231 675.1359 709.6127 739.8229 749.3534 760.9593 769.2897 794.6059 845.9093 850.0714 852.1548 881.9354 904.8126 929.0433 959.4524 964.8259 968.4313 1008.5923 1013.6562 1020.6277 1046.6911 1062.0553 1086.9023 1107.7844 1110.0819 1112.3800 1120.3813 1130.9055 1147.7892 1158.6633 1166.2972 1177.5122 1187.0436 1212.3912 1219.9179 1238.9146 1243.0176 1273.7694 1276.9481 1286.0533 1311.6100 1315.8288 1331.3507 1357.0980 1366.2777 1374.8868 1410.4942 1421.9555 1430.7624 1441.0072 1445.2460 1452.8382 1455.9627 1463.5518 1464.4068 1470.9765 1476.9803 1480.8353 1482.1548 1495.9695 1581.0726 1601.0638 1633.9035 1636.1182 2781.2641 2848.6869 2862.0994 2972.3203 2985.9094 3003.1752 3006.4702 3023.2615 3032.2678 3036.9748 3052.0726 3086.9527 3091.0181 3104.3084 3121.1548 3128.6731 3142.5841 3147.3579 3160.7710 3604.9036
redmass: 5.2779 5.2607 4.4133 3.7549 2.9181 1.0773 3.7356 3.3808 4.1785 3.5810 1.9867 2.0207 1.8242 3.8336 3.8742 3.3865 3.6876 2.8300 2.4196 3.6699 3.5419 3.0044 3.8443 1.2280 3.0970 4.8147 3.6399 3.6007 4.8449 3.5331 4.8067 3.7222 4.0785 2.2218 1.5547 3.3936 3.3941 1.9268 5.4375 1.5052 3.1627 2.2695 3.8459 1.3855 4.5936 2.5901 1.2988 2.4774 2.1871 2.1783 1.9640 1.9721 2.8321 2.3144 1.4917 1.2752 1.8033 2.1935 1.4476 1.6288 1.3300 1.4453 1.6258 1.4452 1.4065 2.4379 1.4626 1.7146 1.3995 1.9849 1.4491 1.4027 1.7865 1.7147 1.5678 1.6764 3.8264 1.1940 1.1696 1.8373 1.4447 1.0504 1.1062 1.0747 1.0538 1.4898 2.3656 1.1610 2.2907 1.1007 6.6688 7.4389 7.1199 8.7785 1.0789 1.0660 1.0621 1.0602 1.0683 1.0298 1.0614 1.0996 1.0727 1.0894 1.0975 1.1001 1.0927 1.1045 1.0846 1.0890 1.0951 1.1047 1.1001 1.0802
irintensity: 0.6414 1.8211 0.7829 0.4840 0.2189 0.2201 1.2896 1.7235 2.1825 0.4047 4.9757 5.3455 0.8739 6.3143 12.2971 13.4098 1.9181 1.1851 0.5311 1.4824 2.7389 8.7198 0.1966 88.9710 13.8164 3.3818 3.9768 7.2062 0.3363 4.8145 7.5969 3.6433 3.8444 27.4021 84.7489 5.9954 8.5189 5.6625 6.9240 0.0748 3.1123 6.7406 2.9180 3.1356 15.8350 11.7317 0.0326 21.7915 1.9191 21.6721 7.5055 25.7316 6.9053 10.8265 29.1702 0.6883 34.4689 112.8156 12.2991 50.9280 42.9865 13.7532 13.4099 3.6756 24.2848 6.3701 48.1635 37.8275 16.6173 13.4318 22.6865 33.4281 67.4664 26.4492 29.5854 14.3107 10.7380 24.9000 4.0559 0.4095 27.2168 13.5090 5.5017 7.7660 18.0700 21.4328 21.5178 8.5445 4.8114 23.5608 1.0552 3.8799 13.8313 138.4531 74.4080 44.7291 210.7502 37.3805 9.0161 36.0291 27.6512 34.1817 27.8885 59.9931 43.7948 31.7593 11.8890 27.7392 1.4666 3.5625 36.3483 16.7699 35.8304 43.7925
temp: 298.150 k
press: 1.00000 atm
elementType: 8 8 7 7 6 6 6 6 6 6 6 6 6 6 6 6 6 6 6 6 1 1 1 1 1 1 1 1 1 1 1 1 1 1 1 1 1 1 1 1
symmnumber: 1
zpe: 870065.4 jmol-1
zpe.correction: 0.331390 hartree
zpe.thermalcorrener: 0.350351 hartree
zpe.thermalcorrenthalpy: 0.351295 hartree
zpe.thermalcorrgfe: 0.282128 hartree
zpe.sumelectzpe: -880.171804 hartree
zpe.sumelectthermal: -880.152843 hartree
zpe.sumelectthermalent: -880.151899 hartree
zpe.sumelectthermalfe: -880.221066 hartree
dipole: -1.6496 1.4073 -0.1676
dipole: 2.1748
quadrupole: -115.0320 -108.2452 -117.0964
quadrupole: 0.5230 -1.9746 -0.9232
quadrupole: -1.5741 5.2126 -3.6385 0.5230 -1.9746 -0.9232
hfenergy: -880.5031941 hartree
pointgroup: C01 [X(C16H20N2O2)]
dipole: 0.6835058 -0.5133049 -0.0377335 debye
polarizability: 230.021826|-29.5568131|195.4197496|-19.4006378|-17.5296733|153.0598633 unknown
InChI: InChI=1S/C16H20N2O2/c1-18-10-9-12-11-5-3-4-6-13(11)17-16(12)14(18)7-8-15(19)20-2/h3-6,14,17H,7-10H2,1-2H3
charge 0 multiplicity 1
40 atoms
O  3.967819 1.694546 1.195662
O  3.377035 2.06143 -1.025954
N  0.986185 -2.485786 0.16229
N  -0.908306 0.458199 -1.277796
C  0.764714 -1.467583 -0.912016
C  -0.501941 -0.70477 -0.598656
C  -1.435087 -1.014032 0.386273
C  -1.255985 -2.223129 1.26545
C  -0.262248 -3.18665 0.580467
C  1.98195 -0.510455 -1.053616
C  -2.472407 -0.002772 0.332363
C  -2.115013 0.910651 -0.72641
C  2.045805 -3.451567 -0.198907
C  2.310613 0.229945 0.257289
C  -3.669012 0.227955 1.061442
C  -2.910529 2.026289 -1.062521
C  -4.467467 1.3409 0.729897
C  -4.092563 2.230908 -0.319806
C  3.248536 1.40003 0.032703
C  4.867686 2.87098 1.114182
H  0.639464 -1.981236 -1.905939
H  -0.862957 -1.935971 2.2609
H  -2.217486 -2.747626 1.431958
H  0.028972 -3.988711 1.283113
H  -0.767048 -3.673464 -0.293566
H  1.774477 0.23167 -1.848313
H  2.866617 -1.072569 -1.404341
H  -0.394736 0.915367 -2.028163
H  3.004371 -2.933289 -0.37025
H  1.805772 -4.046058 -1.117223
H  2.194891 -4.157492 0.636488
H  2.728749 -0.450581 1.01607
H  1.374585 0.63089 0.697607
H  -3.967582 -0.447372 1.871487
H  -2.627059 2.713593 -1.867747
H  -5.393013 1.530501 1.285197
H  -4.734219 3.088104 -0.552814
H  5.330888 2.938723 2.108468
H  4.28846 3.780759 0.882358
H  5.627968 2.718274 0.329669
