program: Gaussian 09
title: 000288345
version: EM64L-G09RevD.01
frameworkgroup: C1[X(C10H18N2O4)]
method: RPBEPBE
basis: SDD
operation: Freq
keyword: #p
keyword: freq=noraman
keyword: PBEPBE/SDD
title: #p freq=noraman PBEPBE/SDD
converged: YES YES NO NO
title: Mulliken charges:
elementType: O O O O N N C C C C C C C C C C H H H H H H H H H H H H H H H H H H
charge: -0.306684 -0.306676 -0.296989 -0.296995 -0.380067 -0.380092 -0.113956 -0.113841 -0.464713 -0.464682 0.291444 0.291462 -0.257391 -0.257379 -0.663125 -0.663147 0.270045 0.270029 0.212669 0.245714 0.212677 0.245711 0.321183 0.321192 0.218728 0.234522 0.218727 0.234500 0.250088 0.225166 0.213297 0.250123 0.225162 0.213295
chargesum: 0.00000
title: Mulliken charges with hydrogens summed into heavy atoms:
elementType: O O O O N N C C C C C C C C C C
charge: -0.306684 -0.306676 -0.296989 -0.296995 -0.058883 -0.058900 0.156089 0.156189 -0.006331 -0.006294 0.291444 0.291462 0.195860 0.195847 0.025426 0.025434
polarizability: 1.47430582e+02 -2.41607538e-03 1.54147260e+02 -9.42320645e-01 -4.70220123e-03 1.13913961e+02
1716.lowfreq: -4.6132 0.0006 0.0007 0.0009 7.3625 7.3883 15.6796 30.5419 36.2042
frequency: 15.6789 30.2284 36.0850 54.4988 68.6265 72.4671 91.8359 111.1843 112.3567 126.6424 177.2531 208.8754 224.1181 230.5490 288.1432 293.3289 312.1436 339.6534 364.1289 419.4093 421.8743 469.4862 524.8192 594.3228 597.0511 650.1303 651.8309 661.5260 697.1940 698.7926 795.7676 801.3227 809.8776 809.9258 847.6525 861.0665 926.3286 928.2219 944.8629 951.9290 982.0826 1027.7031 1038.4366 1075.3111 1095.4724 1096.0089 1113.3911 1153.8443 1157.0647 1157.2759 1174.5118 1185.3165 1190.0967 1208.9690 1218.1855 1239.3782 1250.3630 1258.4460 1283.2361 1283.2840 1329.0793 1352.8705 1360.7250 1368.6940 1388.6981 1389.4265 1457.4152 1457.6350 1460.2206 1462.0623 1462.2078 1470.9600 1482.6211 1484.4447 1492.3881 1499.5681 1658.2300 1660.3881 2990.8076 2990.9103 3021.4131 3024.3546 3027.2219 3027.3436 3043.2251 3056.7053 3085.8016 3086.0242 3090.5695 3090.5805 3101.3614 3114.2207 3116.8035 3116.8302 3558.0685 3558.1480
redmass: 4.3036 3.9997 3.5350 4.4919 3.5400 5.1413 3.7306 3.7505 2.9423 3.4888 1.8001 1.2342 1.8756 2.7837 4.7253 2.4040 3.1467 4.2499 4.0115 3.1223 3.0167 2.7255 3.0998 1.1792 1.2488 4.4536 4.4176 2.5984 12.1461 11.8630 1.8867 1.3047 1.5560 1.3809 2.6318 2.0910 3.0143 1.6045 3.7385 3.5226 3.2723 3.7458 4.3584 1.9778 2.1554 2.1400 2.6682 3.1276 1.6960 1.8825 1.7930 1.8324 2.1403 1.3718 1.5984 1.4071 1.4876 1.7030 1.1101 1.1096 1.2834 1.2394 1.2625 1.3708 1.2368 1.2369 1.0878 1.0877 1.0951 1.0485 1.0519 1.1362 1.0780 1.0590 1.6811 1.9270 8.6171 8.9298 1.0361 1.0361 1.0592 1.0668 1.0597 1.0598 1.0854 1.0847 1.0973 1.0973 1.1032 1.1032 1.1050 1.1060 1.1055 1.1056 1.0770 1.0769
irintensity: 0.1179 2.6227 1.5975 6.0915 3.4328 7.7226 0.0007 0.4301 0.4266 1.5165 0.1391 5.7431 4.3010 0.1934 18.6799 5.5651 26.4175 0.2514 1.3985 5.9647 0.6206 3.5856 0.8331 113.1797 126.7916 9.1648 4.7789 21.2308 31.4486 25.5201 0.0652 5.7511 1.4249 1.9140 7.5851 2.3198 12.4050 4.2658 45.2475 9.7998 13.0533 135.6074 239.5598 8.8096 56.0868 8.5467 0.2190 115.8342 46.8193 5.2351 83.5735 151.8068 35.2569 42.0539 91.2742 0.4521 100.6872 125.0867 5.2638 4.3008 62.6869 14.8454 1.9706 15.6371 7.1108 45.0417 17.6708 1.7250 22.8229 0.5070 12.8583 3.8559 7.9719 1.0091 411.5958 365.9219 497.1567 58.2979 0.1804 39.4602 33.4603 20.9645 76.7863 0.7765 0.2422 21.1353 75.6658 5.9481 0.9009 1.3096 21.8070 35.8868 7.1024 65.8423 53.7820 3.1740
temp: 298.150 k
press: 1.00000 atm
elementType: 8 8 8 8 7 7 6 6 6 6 6 6 6 6 6 6 1 1 1 1 1 1 1 1 1 1 1 1 1 1 1 1 1 1
symmnumber: 1
zpe: 740175.0 jmol-1
zpe.correction: 0.281918 hartree
zpe.thermalcorrener: 0.299977 hartree
zpe.thermalcorrenthalpy: 0.300921 hartree
zpe.thermalcorrgfe: 0.232630 hartree
zpe.sumelectzpe: -801.004602 hartree
zpe.sumelectthermal: -800.986543 hartree
zpe.sumelectthermalent: -800.985598 hartree
zpe.sumelectthermalfe: -801.053890 hartree
dipole: -0.0005 0.2700 -0.0005
dipole: 0.2700
quadrupole: -90.5689 -82.6524 -101.2454
quadrupole: -0.0009 9.4595 0.0015
quadrupole: 0.9200 8.8365 -9.7565 -0.0009 9.4595 0.0015
hfenergy: -801.2865193 hartree
pointgroup: C01 [X(C10H18N2O4)]
dipole: -0.0001434 -0.1062134 0.0002863 debye
polarizability: 146.7880789|0.0043443|154.1472041|4.6914456|-0.0474118|114.5565199 unknown
InChI: InChI=1S/C10H18N2O4/c1-3-15-9(13)11-7-5-6-8(7)12-10(14)16-4-2/h7-8,11-12H,3-6H2,1-2H3
charge 0 multiplicity 1
34 atoms
O  -3.324358 0.647301 0.405126
O  3.323486 0.650015 -0.406068
O  -2.435671 0.035737 -1.698448
O  2.436487 0.041705 1.699148
N  -1.71533 -0.952561 0.313232
N  1.715803 -0.950988 -0.310242
C  -0.736323 -1.849673 -0.270445
C  0.738026 -1.847907 0.27579
C  -0.781694 -3.391813 0.023935
C  0.785537 -3.390798 -0.014392
C  -2.47497 -0.085513 -0.445498
C  2.475219 -0.081929 0.446411
C  -4.167622 1.676962 -0.264826
C  4.166516 1.681393 0.261545
C  -3.395189 2.986628 -0.448184
C  3.393178 2.990676 0.443812
H  -0.745007 -1.670201 -1.360008
H  0.746449 -1.665497 1.36487
H  -1.164424 -3.601403 1.039049
H  -1.317714 -4.020628 -0.702714
H  1.168594 -3.602633 -1.028916
H  1.322401 -4.016884 0.713988
H  -1.849318 -0.930457 1.325494
H  1.849282 -0.930828 -1.322612
H  -5.024105 1.794478 0.418688
H  -4.508681 1.27584 -1.235612
H  5.022202 1.798637 -0.423013
H  4.508911 1.281972 1.232564
H  -2.549198 2.843384 -1.141209
H  -3.009784 3.355641 0.518121
H  -4.062902 3.759473 -0.873063
H  2.548026 2.847709 1.137912
H  3.006484 3.357983 -0.522628
H  4.060689 3.76468 0.866896
