program: Gaussian 09
title: 000288331
version: EM64L-G09RevD.01
frameworkgroup: C1[X(C12H12N2O)]
method: RPBEPBE
basis: SDD
operation: Freq
keyword: #p
keyword: freq=noraman
keyword: PBEPBE/SDD
title: #p freq=noraman PBEPBE/SDD
converged: NO NO NO NO
title: Mulliken charges:
elementType: O N N C C C C C C C C C C C C H H H H H H H H H H H H
charge: -0.239093 -0.060644 -0.068640 0.046469 0.154077 0.120986 -0.777056 -0.749479 0.432326 -0.332673 -0.362318 -0.371884 -0.233452 -0.220806 -0.228643 0.230158 0.230154 0.259140 0.234598 0.251648 0.234559 0.250271 0.233346 0.271905 0.231997 0.230480 0.232574
chargesum: 0.00000
title: Mulliken charges with hydrogens summed into heavy atoms:
elementType: O N N C C C C C C C C C C C C
charge: -0.239093 -0.060644 -0.068640 0.046469 0.154077 0.120986 -0.057604 -0.028674 0.432326 -0.082402 -0.128972 -0.099979 -0.001455 0.009674 0.003931
polarizability: 3.31609323e+02 -6.90415730e+00 1.43724019e+02 -2.49869387e-02 -1.05904004e-01 6.66357918e+01
1716.lowfreq: 0.0004 0.0007 0.0009 2.5446 7.8784 15.1380 37.0766 52.1305 61.3682
frequency: 37.0201 52.0984 61.3357 111.6422 113.4806 129.7030 177.1910 206.9804 215.3499 250.6832 262.0118 292.2563 372.9599 394.7373 406.2409 496.4047 514.6694 557.8010 614.6856 614.9054 622.4541 689.0227 692.1231 699.1103 757.6419 774.8245 823.9664 848.8118 857.2278 917.6031 931.9801 981.6206 987.8029 990.4745 992.4957 1007.7614 1021.8344 1031.3260 1039.3534 1053.2330 1079.8043 1122.5597 1172.7105 1180.1205 1221.6582 1265.7702 1312.5719 1353.8665 1386.2669 1394.1037 1398.9834 1409.2951 1440.9996 1448.1803 1463.8891 1472.3536 1472.5983 1477.6331 1484.5213 1564.6584 1589.8525 1601.2846 1626.8258 2976.1371 2987.8480 3015.4629 3049.8292 3068.1106 3099.4452 3108.7122 3121.1200 3131.5816 3145.0505 3159.0597 3169.5937
redmass: 3.8064 4.5796 4.5709 1.5449 1.6473 1.0962 5.4898 2.9423 4.0742 3.5841 2.6740 3.7067 6.7048 4.1611 2.8426 3.1264 5.4505 5.6271 6.4779 6.7146 5.0900 4.0414 5.4882 1.8949 8.7084 1.7791 9.6092 4.9715 1.2514 2.5306 1.3741 1.5813 6.2225 1.4152 1.7083 1.3520 2.1332 1.3948 4.1337 1.5660 1.6000 2.9015 1.0740 1.1112 3.4055 2.6016 1.5028 1.8615 3.8209 1.5019 1.3450 2.2768 2.2431 2.1328 1.0456 1.8254 1.0493 1.2486 2.2010 6.5395 5.8413 6.2975 7.5833 1.0377 1.0371 1.0882 1.0977 1.0981 1.0980 1.0986 1.0875 1.0871 1.0921 1.0959 1.1006
irintensity: 2.9243 0.5975 0.8823 2.1871 0.4182 0.0034 3.3672 1.8925 1.0263 0.8552 11.9511 0.6824 5.7433 0.1457 0.2924 15.4285 8.2724 0.8118 0.0444 0.0753 31.2451 15.0519 11.9843 39.5744 9.8970 48.5064 1.5986 2.2370 0.1567 5.8677 0.0294 20.4278 1.1371 2.7993 9.2135 2.0958 5.1281 5.5277 46.6132 0.0925 9.7490 32.9360 3.1268 8.8738 10.8495 13.2983 10.3429 0.7425 8.1895 20.3930 6.3529 6.5987 21.6469 28.0601 5.3137 64.6877 28.7753 28.5572 1.7623 68.6546 23.4780 3.1209 3.5478 33.2038 26.9759 20.3568 21.0964 15.0286 7.5091 8.8546 5.8954 0.0326 20.1770 24.6453 29.8576
temp: 298.150 k
press: 1.00000 atm
elementType: 8 7 7 6 6 6 6 6 6 6 6 6 6 6 6 1 1 1 1 1 1 1 1 1 1 1 1
symmnumber: 1
zpe: 553723.2 jmol-1
zpe.correction: 0.210902 hartree
zpe.thermalcorrener: 0.224799 hartree
zpe.thermalcorrenthalpy: 0.225743 hartree
zpe.thermalcorrgfe: 0.169169 hartree
zpe.sumelectzpe: -648.089920 hartree
zpe.sumelectthermal: -648.076023 hartree
zpe.sumelectthermalent: -648.075079 hartree
zpe.sumelectthermalfe: -648.131653 hartree
dipole: 1.3131 2.6158 0.0085
dipole: 2.9269
quadrupole: -67.0498 -85.5687 -91.6469
quadrupole: -12.0679 -0.0395 -0.0575
quadrupole: 14.3720 -4.1469 -10.2251 -12.0679 -0.0395 -0.0575
hfenergy: -648.3008222 hartree
pointgroup: C01 [X(C12H12N2O1)]
dipole: -0.52162 -1.0253839 0.0501093 debye
polarizability: 331.4409223|-8.0198072|143.7170798|-4.7091927|-2.5124469|66.8111311 unknown
InChI: InChI=1S/C12H12N2O/c1-9-10(2)14-15-12(9)13-8-11-6-4-3-5-7-11/h3-8H,1-2H3
charge 0 multiplicity 1
27 atoms
O  2.015165 1.50359 -0.206472
N  3.477994 1.516146 -0.236695
N  0.256967 -0.198464 -0.10664
C  2.712347 -0.685103 -0.13585
C  3.843095 0.207175 -0.193206
C  1.585598 0.138703 -0.145126
C  2.726803 -2.185243 -0.077368
C  5.302626 -0.150844 -0.209223
C  -2.124768 0.302914 -0.079214
C  -0.714722 0.69709 -0.11922
C  -3.129306 1.311881 -0.093241
C  -2.517176 -1.066796 -0.028389
C  -4.495113 0.962997 -0.057882
C  -3.880522 -1.411294 0.006576
C  -4.874493 -0.39898 -0.008122
H  3.230488 -2.620146 -0.961382
H  3.266122 -2.550025 0.817316
H  1.694549 -2.56983 -0.041466
H  5.545289 -0.783754 -1.082459
H  5.91745 0.762436 -0.256789
H  5.581768 -0.715698 0.699069
H  -0.501752 1.781706 -0.160447
H  -2.831365 2.36721 -0.132417
H  -1.732073 -1.829427 -0.018259
H  -5.261135 1.745779 -0.069182
H  -4.178285 -2.464983 0.045287
H  -5.935354 -0.671942 0.019103
