program: Gaussian 09
title: 000288332
version: EM64L-G09RevD.01
frameworkgroup: C1[X(C12H11ClN2O)]
method: RPBEPBE
basis: SDD
operation: Freq
keyword: #p
keyword: freq=noraman
keyword: PBEPBE/SDD
title: #p freq=noraman PBEPBE/SDD
converged: NO NO NO NO
title: Mulliken charges:
elementType: Cl O N N C C C C C C C C C C C C H H H H H H H H H H H
charge: -0.061614 -0.237262 -0.056928 -0.066952 0.049357 0.155391 0.121006 -0.774495 -0.748143 0.456190 -0.333072 -0.337623 -0.376225 -0.086865 -0.213279 -0.227604 0.232009 0.259789 0.232009 0.235675 0.252548 0.235889 0.254081 0.296814 0.239772 0.238256 0.261275
chargesum: 0.00000
title: Mulliken charges with hydrogens summed into heavy atoms:
elementType: Cl O N N C C C C C C C C C C C C
charge: -0.061614 -0.237262 -0.056928 -0.066952 0.049357 0.155391 0.121006 -0.050688 -0.024031 0.456190 -0.078991 -0.040809 -0.136452 -0.086865 0.024977 0.033672
polarizability: 3.36840728e+02 -2.26549576e+01 1.72070019e+02 1.03874197e-02 -7.68523931e-03 6.91208981e+01
1716.lowfreq: -1.9931 0.0009 0.0021 0.0027 5.7677 10.8760 28.6964 48.2246 50.8428
frequency: 28.6774 48.2242 50.8396 101.1556 112.5838 124.5027 132.4284 175.8014 206.7585 217.5694 249.6420 268.6201 282.0429 294.1541 376.3963 380.4537 410.5807 441.1882 516.4825 545.7479 558.9427 616.5328 620.6181 668.1760 681.4948 697.7136 700.2486 761.8272 791.5199 829.6719 893.4499 905.5857 917.9054 920.5545 974.0695 982.5888 988.2170 993.4548 1031.5901 1040.9279 1054.4381 1065.5912 1086.3456 1124.0070 1176.7428 1214.7131 1259.1090 1276.1256 1351.1560 1383.0639 1394.3876 1399.1806 1408.4118 1427.0044 1446.2735 1461.1800 1463.1067 1471.2667 1475.2031 1477.3650 1558.2101 1582.3373 1594.7311 1623.4175 2977.6412 2987.7547 3021.6215 3051.3890 3068.2038 3100.7618 3109.0692 3133.1931 3155.6610 3175.6619 3177.8612
redmass: 5.1443 6.0634 4.5704 1.0435 2.8882 1.1616 8.7217 4.6869 2.9999 4.3642 3.7746 2.7413 5.7277 3.7137 7.1762 9.8860 4.3402 3.0874 5.5585 4.7210 5.5698 6.7188 5.2389 6.7346 2.8310 5.7070 3.2180 8.9482 1.4534 11.7333 5.0445 1.3679 2.4889 1.3999 1.4794 5.8428 1.4942 1.7108 1.3951 4.1177 1.5661 2.0169 1.6728 2.8083 1.0883 3.1083 2.7377 1.3783 2.1800 5.5517 1.4353 1.3031 2.0948 2.6754 1.8896 2.7442 1.0455 1.0448 1.9199 1.2041 6.8687 6.1024 6.6339 8.0396 1.0377 1.0372 1.0886 1.0976 1.0981 1.0981 1.0986 1.0883 1.0925 1.0940 1.0968
irintensity: 4.2551 0.8936 1.1900 0.7900 1.6724 0.0295 1.7005 1.9467 1.1996 0.2985 0.9774 9.9055 3.0494 0.5250 4.7195 6.1356 2.5178 7.9737 7.6934 0.4864 0.3786 0.2433 25.6332 34.6799 28.6811 23.8842 7.7617 8.2066 44.5707 0.3890 26.7973 0.8203 3.4948 6.9121 13.6171 3.0691 14.7193 8.7514 5.6833 42.9199 0.0759 16.3335 3.0368 42.6089 2.8393 46.7127 21.5189 1.3489 5.4551 1.0946 17.5953 9.0904 8.9498 47.7823 16.9621 48.2341 5.9931 28.2992 61.6955 7.1183 33.9190 34.5329 9.5492 10.7441 28.3251 24.9125 20.4599 19.5600 14.1024 7.0040 8.3701 5.1774 13.9577 0.9240 9.9589
temp: 298.150 k
press: 1.00000 atm
elementType: 17 8 7 7 6 6 6 6 6 6 6 6 6 6 6 6 1 1 1 1 1 1 1 1 1 1 1
symmnumber: 1
zpe: 527978.6 jmol-1
zpe.correction: 0.201096 hartree
zpe.thermalcorrener: 0.216314 hartree
zpe.thermalcorrenthalpy: 0.217258 hartree
zpe.thermalcorrgfe: 0.156984 hartree
zpe.sumelectzpe: -1107.479639 hartree
zpe.sumelectthermal: -1107.464421 hartree
zpe.sumelectthermalent: -1107.463477 hartree
zpe.sumelectthermalfe: -1107.523752 hartree
dipole: 0.2074 0.5890 0.0082
dipole: 0.6245
quadrupole: -90.2545 -96.5120 -103.1021
quadrupole: -24.6306 -0.0192 -0.0116
quadrupole: 6.3683 0.1109 -6.4792 -24.6306 -0.0192 -0.0116
hfenergy: -1107.6807357 hartree
pointgroup: C01 [X(C12H11Cl1N2O1)]
dipole: -0.0635469 0.2368803 -0.0147022 debye
polarizability: 339.3387775|9.6966044|169.3244605|-1.2684486|-4.9567982|69.3684071 unknown
InChI: InChI=1S/C12H11ClN2O/c1-8-9(2)15-16-12(8)14-7-10-4-3-5-11(13)6-10/h3-7H,1-2H3
charge 0 multiplicity 1
27 atoms
Cl -4.288272 2.604549 -0.259492
O  2.439302 -1.510302 -0.076102
N  3.896069 -1.390121 -0.086018
N  0.533389 0.024346 -0.147999
C  2.933271 0.731648 -0.190507
C  4.141558 -0.054613 -0.154179
C  1.887129 -0.19096 -0.141159
C  2.811208 2.225873 -0.265595
C  5.562151 0.433715 -0.183466
C  -1.795504 -0.668822 -0.107332
C  -0.356326 -0.949292 -0.097958
C  -2.279037 0.670687 -0.170958
C  -2.722275 -1.747116 -0.052393
C  -3.661244 0.889041 -0.177738
C  -4.109903 -1.494733 -0.060705
C  -4.596674 -0.168434 -0.123786
H  3.291647 2.625009 -1.178845
H  1.748739 2.518434 -0.276265
H  3.298355 2.715269 0.598906
H  5.768518 1.1019 0.672542
H  6.25878 -0.418835 -0.138428
H  5.765054 1.00487 -1.107845
H  -0.056476 -2.01224 -0.047117
H  -1.557965 1.491238 -0.212755
H  -2.3500 -2.777121 -0.003392
H  -4.821928 -2.32522 -0.01837
H  -5.670463 0.039328 -0.130846
