program: Gaussian 09
title: 000288449
version: EM64L-G09RevD.01
frameworkgroup: C1[X(C23H21NO5)]
method: RPBEPBE
basis: SDD
operation: Freq
keyword: #p
keyword: freq=noraman
keyword: PBEPBE/SDD
title: #p freq=noraman PBEPBE/SDD
converged: YES YES NO NO
title: Mulliken charges:
elementType: O O O O O N C C C C C C C C C C C C C C C C C C C C C C C H H H H H H H H H H H H H H H H H H H H H
charge: -0.294342 -0.264996 -0.250977 -0.202791 -0.203116 0.027045 -0.336132 -0.215564 0.617032 0.530499 -0.720741 -0.463034 -0.393173 -0.431814 -0.372863 -0.355643 -0.382558 0.314242 0.230503 -0.225614 -0.239370 -0.238018 0.236707 -0.321037 -0.300978 -0.354871 -0.347764 0.388440 -0.537628 0.231604 0.253533 0.237993 0.234828 0.211738 0.232592 0.223755 0.241411 0.236989 0.250459 0.240076 0.229188 0.227545 0.231627 0.280923 0.277485 0.289990 0.288334 0.221899 0.246396 0.220192
chargesum: 0.00000
title: Mulliken charges with hydrogens summed into heavy atoms:
elementType: O O O O O N C C C C C C C C C C C C C C C C C C C C C C C
charge: -0.294342 -0.264996 -0.250977 -0.202791 -0.203116 0.027045 -0.104528 0.037969 0.617032 0.530499 -0.036182 -0.230442 -0.169418 -0.190403 -0.135874 -0.105185 -0.142482 0.314242 0.230503 0.003574 -0.011825 -0.006391 0.236707 -0.040114 -0.023493 -0.064881 -0.059430 0.388440 0.150860
polarizability: 3.16606583e+02 4.57519595e+01 2.71219419e+02 -1.51786521e+01 -1.16530378e+00 2.48288368e+02
1716.lowfreq: -5.1585 -4.1556 -0.0003 0.0003 0.0005 3.6268 9.2218 12.7808 21.7441
frequency: 8.7402 11.9269 21.6966 24.9764 30.8016 40.6617 47.9107 62.4772 65.3453 79.5432 89.6242 117.4125 142.5197 153.8548 172.6570 197.9234 206.6068 220.1644 229.9645 240.6568 252.8963 264.1778 270.1695 283.4637 327.7772 355.9930 401.5112 406.4447 408.8834 413.2181 435.4429 456.9502 485.9400 488.1783 496.5182 510.3710 524.0974 551.5452 572.0863 616.2528 620.4328 623.8605 633.4904 653.2019 679.2715 684.7929 702.0106 716.4609 736.9310 763.9483 769.8448 772.6499 801.0257 809.5724 814.8715 833.3647 842.7246 852.2684 861.7573 880.7840 887.8375 917.2173 933.8241 937.9906 961.7478 976.4123 987.5266 991.2310 997.1040 998.8250 1001.8425 1005.0013 1010.4775 1014.2518 1026.8181 1057.3907 1076.0479 1082.1122 1089.5684 1108.0567 1111.5260 1112.5060 1136.6814 1157.6476 1174.1724 1174.8731 1180.9715 1189.2930 1211.3335 1214.9781 1220.4781 1232.5306 1239.5238 1250.4117 1284.5192 1291.7297 1303.1666 1307.2590 1329.8430 1354.3726 1366.3979 1388.0413 1390.3033 1391.7853 1405.8308 1414.3098 1420.6033 1437.1803 1445.4789 1467.3585 1472.7369 1474.0452 1474.7222 1476.7159 1484.2238 1502.9723 1585.2633 1588.0484 1595.2626 1609.3668 1613.5558 1617.2196 1623.5770 2958.6730 2983.4314 2993.1763 3035.7370 3046.0110 3078.7663 3092.0728 3116.0355 3121.3279 3124.1235 3125.3339 3128.3714 3139.6682 3150.1387 3160.5719 3164.3098 3165.9798 3166.1962 3176.4415 3187.8240 3193.8838
redmass: 6.7250 5.9283 3.8140 4.2091 5.6222 4.7369 6.6746 5.6041 6.4997 4.5019 7.7532 4.6043 3.7779 4.4689 4.2747 4.0951 2.5707 2.0204 1.5211 3.3541 3.0428 3.0017 3.4643 8.0783 5.9556 6.5393 2.8627 4.7349 2.8714 2.9344 4.1054 4.1147 6.0812 5.0966 4.0696 4.9788 4.3413 2.7096 4.2042 6.4478 5.5357 7.1011 6.9499 6.1747 8.0759 3.9228 1.7422 3.2827 3.6800 5.0336 4.9588 2.7319 4.0311 2.8298 1.8769 1.8224 2.5947 1.3000 1.2501 4.5315 1.7110 1.5385 1.5570 1.5868 1.3645 1.3977 7.4850 5.4468 1.9284 1.8181 1.3891 2.9525 1.4059 1.9525 2.1842 3.6723 2.1464 2.0245 3.1898 1.3283 1.4883 1.2754 2.1496 1.3400 1.0566 1.2243 1.2554 1.1220 2.3266 3.8266 2.2148 3.6697 2.2739 2.0838 1.4704 1.2718 1.4893 1.3461 1.4691 1.6244 7.9580 2.9717 2.3904 1.7492 8.7207 4.3829 2.7999 1.1739 2.1085 1.0501 1.0789 1.0804 2.3108 1.0598 2.2950 2.4079 6.9612 9.2198 6.0682 6.6212 6.1552 9.6421 6.3871 1.0331 1.0365 1.0826 1.0854 1.1039 1.0988 1.1004 1.0889 1.0893 1.0850 1.0992 1.0877 1.0920 1.0964 1.0932 1.0901 1.0953 1.1013 1.0890 1.0958 1.0973
irintensity: 0.0130 0.2668 0.0385 0.4821 0.0771 0.6408 0.6517 0.0300 0.2868 1.1214 6.2129 3.1924 2.2146 0.7563 1.6937 2.8151 1.5475 3.7551 0.0409 1.5788 2.5334 2.9723 0.9966 3.6545 3.4334 3.4646 0.4874 0.8367 0.0452 0.1662 0.5973 1.5620 15.1518 1.0074 1.1465 8.3823 11.3361 52.9963 1.2818 0.1356 5.4109 0.2663 0.9290 0.4256 7.3032 57.3487 57.4665 25.6481 4.7880 4.5295 37.4120 15.7675 4.9257 49.9098 0.4010 36.2274 6.0209 0.4107 0.8560 85.9971 59.0909 19.0295 10.2265 15.2234 0.1060 0.3972 48.2212 2.3844 17.5518 10.5525 1.6798 43.7192 1.9565 15.8189 7.8750 244.1209 30.4303 22.7703 9.8961 11.4582 16.7781 1.7171 1.9240 0.4269 0.3890 3.6461 67.0042 5.5919 216.5475 314.4344 15.8664 193.9831 71.1957 94.0005 2.1770 0.0143 7.9956 12.5349 2.7135 2.3956 84.2729 3.5856 10.2538 9.5590 7.3873 62.6958 0.4003 9.8096 8.5278 13.3665 30.6154 27.3222 7.1440 7.2250 6.7216 123.3629 7.8180 54.3518 0.6307 9.5285 2.0295 73.8498 47.4595 66.1693 23.0794 10.6157 16.7683 48.6892 31.5782 34.0918 18.7627 19.6979 4.8731 20.0716 0.0514 16.0653 30.9731 12.8120 1.3091 9.2897 19.7878 1.1158 0.3169 0.6128
temp: 298.150 k
press: 1.00000 atm
elementType: 8 8 8 8 8 7 6 6 6 6 6 6 6 6 6 6 6 6 6 6 6 6 6 6 6 6 6 6 6 1 1 1 1 1 1 1 1 1 1 1 1 1 1 1 1 1 1 1 1 1
symmnumber: 1
zpe: 1015825.8 jmol-1
zpe.correction: 0.386908 hartree
zpe.thermalcorrener: 0.413431 hartree
zpe.thermalcorrenthalpy: 0.414375 hartree
zpe.thermalcorrgfe: 0.324410 hartree
zpe.sumelectzpe: -1317.772135 hartree
zpe.sumelectthermal: -1317.745611 hartree
zpe.sumelectthermalent: -1317.744667 hartree
zpe.sumelectthermalfe: -1317.834633 hartree
dipole: -5.7422 1.1602 0.8740
dipole: 5.9231
quadrupole: -201.4609 -154.3155 -159.6232
quadrupole: 14.3702 6.1612 11.8506
quadrupole: -29.6610 17.4844 12.1767 14.3702 6.1612 11.8506
hfenergy: -1318.1590427 hartree
pointgroup: C01 [X(C23H21N1O5)]
dipole: -2.2035406 -0.7024275 0.285259 debye
polarizability: 267.8633936|44.6752885|320.8566001|-9.5765582|-2.9900761|247.3943759 unknown
InChI: InChI=1S/C23H21NO5/c1-16(17-10-14-21(28-2)15-11-17)22(18-6-4-3-5-7-18)29-23(25)19-8-12-20(13-9-19)24(26)27/h3-16,22H,1-2H3
charge 0 multiplicity 1
50 atoms
O  -0.313645 -0.803892 -0.114843
O  -2.398858 5.097878 0.194186
O  0.284081 -1.219521 2.106082
O  6.589443 1.565046 0.607822
O  5.841307 2.113066 -1.475867
N  5.678167 1.592123 -0.306065
C  -2.659853 -0.601084 -0.747872
C  -1.675928 -1.412299 0.134567
C  -2.581702 0.898306 -0.454439
C  -1.607768 -2.899593 -0.170652
C  -4.102456 -1.144048 -0.562017
C  -2.286328 1.821742 -1.490884
C  -2.823441 1.414921 0.841228
C  -1.878818 -3.844318 0.848343
C  -1.27237 -3.36209 -1.469548
C  -2.234571 3.206992 -1.249132
C  -2.772473 2.801318 1.108539
C  -2.476941 3.70292 0.05567
C  0.563549 -0.779611 0.962992
C  -1.833099 -5.229794 0.574094
C  -1.218195 -4.74512 -1.743622
C  -1.503485 -5.683756 -0.723255
C  1.87715 -0.159241 0.596691
C  2.908656 -0.16546 1.571053
C  2.098976 0.429494 -0.675114
C  4.160639 0.405975 1.282131
C  3.345883 1.008176 -0.976522
C  4.357837 0.984393 0.008464
C  -2.634414 5.659406 1.526221
H  -2.368571 -0.758585 -1.805181
H  -1.905695 -1.263683 1.20571
H  -4.170509 -2.212049 -0.833635
H  -4.802574 -0.574712 -1.197492
H  -4.437681 -1.032974 0.486114
H  -2.094348 1.449227 -2.504804
H  -3.053931 0.733321 1.669787
H  -2.112747 -3.493378 1.860209
H  -1.038983 -2.640519 -2.261139
H  -2.008415 3.920362 -2.0475
H  -2.960746 3.161097 2.124558
H  -2.044694 -5.951621 1.370578
H  -0.952991 -5.093444 -2.748127
H  -1.462499 -6.757644 -0.93696
H  2.706301 -0.622139 2.544675
H  1.28917 0.433758 -1.408615
H  4.975866 0.413901 2.009797
H  3.548719 1.473071 -1.944453
H  -1.889851 5.288747 2.257637
H  -2.52285 6.746621 1.403263
H  -3.655707 5.427616 1.886826
