program: Gaussian 09
title: 000027633
version: EM64L-G09RevD.01
frameworkgroup: C1[X(C12H12IN5O)]
method: RPBEPBE
basis: SDD
operation: Freq
keyword: #p
keyword: freq=noraman
keyword: PBEPBE/SDD
title: #p freq=noraman PBEPBE/SDD
converged: YES YES NO NO
title: Mulliken charges:
elementType: I O N N N N N C C C C C C C C C C C C H H H H H H H H H H H H
charge: 0.095086 -0.246475 -0.394658 -0.457774 -0.217811 -0.245488 -0.671832 0.413060 0.446933 0.159748 0.278193 -0.436576 -0.433217 -0.296123 -0.793568 -0.136114 -0.142122 0.055375 -0.376259 0.329067 0.300515 0.252314 0.223834 0.308722 0.255946 0.241387 0.241546 0.249583 0.243301 0.296550 0.456858
chargesum: 0.00000
title: Mulliken charges with hydrogens summed into heavy atoms:
elementType: I O N N N N N C C C C C C C C C C C C
charge: 0.095086 -0.246475 -0.065591 -0.157259 -0.217811 -0.245488 0.081576 0.413060 0.446933 0.159748 0.278193 -0.184263 -0.209384 0.012599 -0.054690 0.113469 0.101179 0.055375 -0.376259
polarizability: 3.67844840e+02 1.35913783e+01 2.13656722e+02 1.60233701e-01 -6.62560062e-02 7.40468248e+01
1716.lowfreq: -5.3574 -0.7788 -0.0006 -0.0006 -0.0003 7.2298 21.1204 27.8607 44.6796
frequency: 21.0604 27.8517 44.6644 70.2869 86.9113 115.2566 129.5483 137.7090 158.7101 159.7241 205.8208 229.8916 263.0991 265.2343 300.0672 304.1108 368.9802 408.1639 410.1445 417.0187 500.5339 508.8582 513.0492 553.3327 556.6432 581.8377 607.1639 625.9557 628.0487 644.0143 683.7072 703.4496 712.3593 743.6023 753.3855 813.7617 820.6962 846.9222 850.0936 910.7688 935.7747 941.6180 975.9736 986.1938 986.3924 1029.1838 1044.5483 1051.9289 1056.2059 1076.5263 1111.8509 1124.2830 1161.6249 1187.3660 1218.3921 1259.7093 1289.8423 1302.0173 1330.3726 1370.7419 1398.6874 1399.8359 1410.0257 1424.3774 1463.1534 1466.6774 1467.6031 1473.2763 1529.5575 1542.5838 1577.5602 1601.9389 1603.9564 1644.8118 1662.9574 2736.7152 2979.4525 3055.5934 3113.9066 3115.9000 3162.7408 3170.9336 3189.1668 3195.9106 3536.1866 3552.2803 3584.7797
redmass: 5.4678 4.8951 7.6884 7.1497 4.2270 1.2165 7.9960 5.2235 3.3230 9.7851 3.5811 7.9335 7.8792 3.6629 4.0220 4.1384 4.3691 2.8574 5.8773 1.3647 5.5041 2.6297 6.6750 4.1288 5.0820 7.3747 1.2387 7.1477 1.2715 6.1330 5.0361 3.4749 3.9219 5.5483 6.9549 1.4264 5.5604 1.3827 1.5340 5.6060 6.7074 1.3572 1.9082 1.5743 3.3048 3.1645 1.0804 1.5272 2.3498 2.8683 1.5134 1.4723 3.4532 1.1147 1.9801 1.8935 1.6645 1.7136 2.6781 4.6812 4.6107 1.5863 2.5646 3.4526 1.6185 1.0434 1.5282 1.9664 2.7672 4.1648 7.6725 5.5243 3.1671 4.0018 2.9847 1.0831 1.0390 1.0979 1.0902 1.0969 1.0908 1.0946 1.0936 1.0946 1.0756 1.0779 1.0821
irintensity: 3.9278 0.1922 1.6988 1.4445 11.0405 0.2628 11.9566 0.0181 0.3486 0.1037 3.5644 13.1839 7.9865 3.3195 7.2737 0.0639 0.3756 0.7595 7.7509 15.0150 3.6527 66.1208 0.4279 1.3202 6.0161 0.3649 90.9378 0.4644 142.8787 2.7161 0.6527 0.0138 24.9905 2.1644 15.6778 46.9616 9.2191 46.4863 39.2146 12.7527 2.8984 1.0062 0.9934 12.6686 39.8585 8.5349 126.9825 8.2469 12.9518 13.1883 0.9525 18.7621 34.5715 4.9194 147.0951 173.0567 1.0669 79.6763 39.3751 123.6340 136.4018 12.9498 19.6485 310.6574 688.2506 18.0071 14.4185 503.7091 1038.5526 532.1428 90.9150 82.0505 73.7070 191.2325 695.6576 731.6073 20.7370 15.1538 17.3974 11.6406 5.5485 4.6143 2.4876 24.6850 22.7778 43.6996 38.4895
temp: 298.150 k
press: 1.00000 atm
elementType: 53 8 7 7 7 7 7 6 6 6 6 6 6 6 6 6 6 6 6 1 1 1 1 1 1 1 1 1 1 1 1
symmnumber: 1
zpe: 605212.0 jmol-1
zpe.correction: 0.230513 hartree
zpe.thermalcorrener: 0.248133 hartree
zpe.thermalcorrenthalpy: 0.249077 hartree
zpe.thermalcorrgfe: 0.181742 hartree
zpe.sumelectzpe: -823.646258 hartree
zpe.sumelectthermal: -823.628638 hartree
zpe.sumelectthermalent: -823.627694 hartree
zpe.sumelectthermalfe: -823.695029 hartree
dipole: 3.5612 1.0018 0.0268
dipole: 3.6995
quadrupole: -180.1978 -91.1628 -131.6219
quadrupole: -27.1491 -0.1323 -0.0361
quadrupole: -45.8703 43.1647 2.7056 -27.1491 -0.1323 -0.0361
hfenergy: -823.8767706 hartree
pointgroup: C01 [X(C12H12I1N5O1)]
dipole: -1.2756129 -0.6965031 0.0783371 debye
polarizability: 353.932126|46.204316|225.5600314|-2.4593696|-17.3185251|76.0562295 unknown
InChI: InChI=1S/C12H12IN5O/c1-7-6-10(19)17-12(15-7)18-11(14)16-9-4-2-8(13)3-5-9/h2-6,15-16H,14H2,1H3
charge 0 multiplicity 1
31 atoms
I  -6.262374 -2.35909 0.571428
O  5.070228 1.986232 0.180107
N  2.38297 -1.067307 0.521895
N  -1.362457 1.743244 0.147407
N  0.582177 0.384216 0.328156
N  2.840416 1.262444 0.245883
N  0.763048 2.749848 0.050289
C  3.741062 -1.396236 0.575838
C  -2.400789 0.778914 0.24998
C  1.957037 0.254286 0.357974
C  0.024602 1.605328 0.177979
C  4.665594 -0.380609 0.462343
C  -3.736099 1.265415 0.183003
C  -2.180933 -0.613993 0.411282
C  4.070811 -2.857244 0.757218
C  -4.833084 0.385604 0.273815
C  -3.279759 -1.494434 0.502666
C  4.250909 1.025064 0.288141
C  -4.598495 -0.997852 0.43376
H  1.653102 -1.777794 0.600522
H  -1.693142 2.703444 0.032104
H  5.735937 -0.593691 0.499292
H  -3.926904 2.339344 0.058455
H  -1.154293 -0.977089 0.460854
H  5.161329 -3.002665 0.784731
H  3.664616 -3.466978 -0.07224
H  3.649208 -3.249993 1.702133
H  -5.85189 0.779519 0.220137
H  -3.097446 -2.565756 0.62716
H  0.347851 3.673571 -0.064061
H  1.817666 2.55756 0.082947
