program: Gaussian 09
title: 000288325
version: EM64L-G09RevD.01
frameworkgroup: C1[X(C10H12N4O2)]
method: RPBEPBE
basis: SDD
operation: Freq
keyword: #p
keyword: freq=noraman
keyword: PBEPBE/SDD
title: #p freq=noraman PBEPBE/SDD
converged: YES YES NO NO
title: Mulliken charges:
elementType: O O N N N N C C C C C C C C C C H H H H H H H H H H H H
charge: -0.212567 -0.210124 -0.092991 -0.026956 -0.168566 0.019707 -0.449738 -0.440847 -0.358487 -0.348886 0.212571 -0.429138 -0.361581 0.395266 -0.166755 -0.377804 0.235493 0.231819 0.234280 0.234418 0.246404 0.259535 0.234383 0.254977 0.313514 0.251872 0.235737 0.284463
chargesum: 0.00000
title: Mulliken charges with hydrogens summed into heavy atoms:
elementType: O O N N N N C C C C C C C C C C
charge: -0.212567 -0.210124 -0.092991 -0.026956 -0.168566 0.019707 0.017574 0.027851 0.147452 0.140473 0.212571 -0.115625 -0.109709 0.395266 0.068983 -0.093341
polarizability: 2.71536615e+02 -1.52975838e+01 1.60284657e+02 -1.52748977e+00 1.44410074e+00 7.23199769e+01
1716.lowfreq: -17.7115 -4.9155 -0.0006 0.0003 0.0004 4.9705 14.7814 39.9246 57.3842
frequency: -1.3446 39.7587 57.3493 63.3099 117.1654 159.3051 168.0102 183.3206 230.2996 246.6494 300.0043 332.2881 376.3229 380.1998 429.9751 480.0931 546.1081 556.8865 559.4954 570.4170 651.2764 685.7503 698.5240 709.8996 764.1222 813.0751 815.1612 849.7582 855.5698 904.3706 914.1059 933.6260 938.6395 949.4113 982.4570 984.6949 993.3993 1053.6602 1069.3976 1077.2690 1102.4874 1150.2601 1157.1340 1163.7820 1172.9754 1196.5378 1203.6621 1216.2471 1247.7797 1257.7157 1293.8145 1300.7422 1309.7773 1333.9408 1340.8914 1370.8400 1371.6751 1395.6531 1440.4748 1466.8380 1469.9580 1472.8362 1482.1649 1491.4800 1573.8278 1609.6531 2982.4729 2994.2143 3014.7468 3016.6549 3056.6907 3076.2910 3085.1929 3099.1317 3146.1358 3167.9575 3189.4265 3191.4869
redmass: 3.2353 4.9781 5.8572 5.8536 3.6368 5.6488 5.2104 2.7118 1.8095 7.4474 5.4498 4.5244 9.4018 6.3159 3.4607 9.7827 5.2099 5.6650 5.6974 2.0242 7.2130 2.1075 4.6631 6.8192 4.2065 2.3286 1.5234 2.4626 2.0570 2.4492 1.6698 1.4758 2.4999 1.4368 3.5534 2.5794 1.3458 1.9760 1.8368 1.5310 1.4858 1.7963 1.4568 1.1767 2.3192 2.8350 1.3604 8.2860 1.4328 1.7762 1.6266 1.4366 1.2625 1.9635 2.3716 6.3939 6.3964 5.9221 3.5249 2.8200 1.0892 1.0904 1.0910 1.0905 6.5954 7.4711 1.0666 1.0632 1.0655 1.0628 1.0985 1.0969 1.1010 1.1053 1.0876 1.0948 1.0916 1.0955
irintensity: 0.0145 0.8343 0.7155 0.7153 1.2552 0.9946 2.9486 2.7513 1.4302 2.2719 0.1545 1.9694 0.9007 1.8594 0.5339 9.4953 5.4427 9.0467 0.3326 1.3942 4.2078 30.1881 30.1429 15.5953 11.2795 3.2283 37.5102 15.7560 3.2805 8.3315 1.0476 4.2156 0.7208 20.9839 4.0802 6.9067 1.3292 4.9497 17.8290 21.2355 6.8392 10.1017 4.9511 7.8451 3.8207 5.3051 42.2444 299.4941 4.3583 35.1450 73.0090 46.8813 2.3972 127.1371 9.1036 50.7436 324.2894 276.0446 3.0233 89.1072 9.3842 4.3171 8.3347 1.2542 3.3253 33.7738 52.8389 11.3080 32.9939 28.3331 16.5663 18.0677 28.4518 53.2507 11.1769 11.2456 1.6548 7.0964
temp: 298.150 k
press: 1.00000 atm
elementType: 8 8 7 7 7 7 6 6 6 6 6 6 6 6 6 6 1 1 1 1 1 1 1 1 1 1 1 1
symmnumber: 1
zpe: 568553.2 jmol-1
zpe.correction: 0.216550 hartree
zpe.thermalcorrener: 0.229707 hartree
zpe.thermalcorrenthalpy: 0.230651 hartree
zpe.thermalcorrgfe: 0.175526 hartree
zpe.sumelectzpe: -756.411065 hartree
zpe.sumelectthermal: -756.397908 hartree
zpe.sumelectthermalent: -756.396964 hartree
zpe.sumelectthermalfe: -756.452090 hartree
dipole: 7.8022 2.8829 0.0523
dipole: 8.3179
quadrupole: -86.9175 -93.0408 -93.1048
quadrupole: -18.0364 -0.1862 0.0672
quadrupole: 4.1035 -2.0197 -2.0838 -18.0364 -0.1862 0.0672
hfenergy: -756.6276155 hartree
pointgroup: C01 [X(C10H12N4O2)]
dipole: -3.0454938 0.7468056 0.9363217 debye
polarizability: 269.6377499|23.8591114|130.2825575|-7.8369889|40.7978941|104.2209415 unknown
InChI: InChI=1S/C10H12N4O2/c15-14(16)10-5-3-4-9(8-10)11-12-13-6-1-2-7-13/h3-5,8H,1-2,6-7H2
charge 0 multiplicity 1
28 atoms
O  4.746758 -0.641916 -1.292885
O  2.866694 -1.779173 -1.895832
N  -2.819919 -0.357129 -0.035105
N  -1.487555 -0.290665 -0.145882
N  -0.955921 0.727781 0.518182
N  3.468888 -0.830874 -1.259131
C  -5.082418 -0.067394 0.61722
C  -5.019157 -0.898088 -0.697153
C  -3.682684 0.585926 0.72748
C  -3.569884 -1.437007 -0.717574
C  0.46485 0.79229 0.380213
C  1.255022 -0.096519 -0.399726
C  1.105076 1.845634 1.090568
C  2.646549 0.099863 -0.439903
C  2.504613 2.014228 1.029456
C  3.300395 1.140581 0.260066
H  -5.887896 0.684987 0.602104
H  -5.257566 -0.734782 1.480623
H  -5.763897 -1.710264 -0.723098
H  -5.192144 -0.244541 -1.571303
H  -3.629308 1.589188 0.261678
H  -3.30799 0.689199 1.760999
H  -3.48079 -2.38439 -0.150019
H  -3.165272 -1.599157 -1.729914
H  0.794592 -0.914508 -0.958364
H  0.478675 2.519307 1.684251
H  2.977552 2.831031 1.584207
H  4.385737 1.243589 0.190942
