program: Gaussian 09
title: 000288413
version: EM64L-G09RevD.01
frameworkgroup: C1[X(C20H24BrNO5)]
method: RPBEPBE
basis: SDD
operation: Freq
keyword: #p
keyword: freq=noraman
keyword: PBEPBE/SDD
title: #p freq=noraman PBEPBE/SDD
converged: YES YES NO NO
title: Mulliken charges:
elementType: Br O O O O O N C C C C C C C C C C C C C C C C C C C C H H H H H H H H H H H H H H H H H H H H H H H H
charge: -0.037481 -0.243486 -0.240240 -0.237249 -0.272267 -0.229926 -0.330451 -0.549188 -0.409775 0.548159 -0.738629 0.610364 0.243801 -0.562119 -0.440147 0.220259 -0.512799 0.191041 -0.463207 -0.335684 0.216847 0.202366 -0.265873 -0.537647 -0.539003 -0.539466 -0.539764 0.243555 0.203413 0.262260 0.230663 0.253615 0.250738 0.309941 0.245035 0.244771 0.278817 0.240227 0.265364 0.246136 0.216350 0.218706 0.245167 0.218592 0.218662 0.231726 0.222634 0.247840 0.223604 0.222880 0.250872
chargesum: 0.00000
title: Mulliken charges with hydrogens summed into heavy atoms:
elementType: Br O O O O O N C C C C C C C C C C C C C C C C C C C C
charge: -0.037481 -0.243486 -0.240240 -0.237249 -0.272267 -0.229926 -0.020510 -0.102220 0.083148 0.548159 -0.234276 0.610364 0.243801 -0.317084 -0.195376 0.220259 -0.233982 0.191041 -0.463207 -0.095457 0.216847 0.202366 -0.000509 0.143544 0.143418 0.162733 0.157591
polarizability: 3.01250498e+02 -7.70676507e+00 2.88398952e+02 -2.20229904e+01 -2.02312579e+01 2.19559689e+02
1716.lowfreq: -0.0007 -0.0004 0.0007 0.3001 3.2981 4.6448 8.7898 13.4041 15.0837
frequency: 7.5939 13.3740 15.0713 25.9584 36.5420 44.1084 52.7600 59.2515 79.7983 86.6820 99.8323 117.5427 136.1320 145.6804 151.8561 171.3326 177.4087 181.8763 187.3898 209.0983 215.3854 221.2508 248.2748 254.0538 257.6193 272.7317 279.1897 294.6816 305.4901 351.5978 359.2855 365.7662 385.2305 387.9546 400.2081 432.3412 451.2803 459.6669 464.6522 478.2539 538.8575 560.8178 579.8156 588.5881 601.3418 603.8639 630.1155 639.5025 691.8135 721.1981 722.0782 732.4526 743.7517 746.0287 771.9606 792.9782 808.4846 832.4796 853.7116 861.8279 880.4359 915.1387 922.4864 924.4878 939.3032 983.1488 984.9594 999.9382 1001.0309 1013.8182 1049.5490 1065.9918 1111.4610 1111.9555 1112.5418 1113.3026 1133.2252 1137.9455 1143.3431 1146.3347 1157.3244 1158.6222 1174.9173 1176.4219 1195.5507 1199.4350 1221.7573 1261.4749 1262.1636 1267.0259 1271.8251 1279.2456 1283.2209 1289.8320 1301.1334 1359.5243 1363.4381 1393.9035 1400.2709 1410.9688 1435.3071 1436.0924 1440.9487 1444.6770 1451.2829 1463.6014 1466.6984 1467.3496 1468.4054 1469.4214 1470.7797 1471.6127 1472.4560 1472.8743 1479.9740 1495.4941 1501.6555 1507.6312 1570.4366 1591.5226 1602.2472 1611.5304 1619.7385 2952.5949 2954.5765 2959.2528 2963.8646 2993.8626 3015.1452 3026.7272 3038.1341 3040.3614 3047.3965 3052.2636 3053.8310 3087.8536 3092.4573 3122.9238 3123.1571 3130.7548 3130.8510 3131.1303 3142.6037 3161.3850 3161.9703 3182.2466 3517.8677
redmass: 4.3745 6.4935 6.2792 4.7495 5.0309 5.3077 4.0594 7.0087 3.5803 3.2936 3.7902 4.5695 4.5597 5.4250 4.2674 3.3957 3.4050 3.5004 3.6365 1.9188 2.6345 1.7026 2.3652 1.3664 1.8440 1.9194 1.7948 2.4290 3.5670 3.6774 3.2725 3.6775 4.5621 4.9360 6.8289 2.6766 4.4149 3.1982 3.9642 5.1716 5.0336 5.5391 3.7472 1.3935 4.0922 4.2828 5.1587 4.2868 4.9624 3.9000 3.1352 4.1019 3.0570 4.1655 2.0426 2.7365 1.4985 1.6655 1.7636 1.7913 2.1951 3.6107 3.6955 1.5022 2.6706 8.4533 8.3462 4.6536 4.8253 4.8070 1.8556 2.7118 1.2616 1.2609 1.2609 1.2604 2.2443 1.4924 1.4979 1.8219 1.4098 1.4181 2.2717 1.5736 1.6257 1.5297 2.0199 2.7911 1.9468 3.3724 1.3693 1.4318 1.6683 1.6275 1.2094 1.3002 3.7722 5.2859 7.5258 2.4369 1.2088 1.1819 1.2331 1.3945 1.1227 1.1228 1.0505 1.0503 1.0508 1.0671 1.1030 1.0952 1.0567 1.0542 1.1082 1.9939 2.1053 2.6430 7.8347 7.2216 7.3297 6.6118 6.2828 1.0333 1.0332 1.0332 1.0329 1.0600 1.0609 1.0594 1.1035 1.1037 1.1040 1.1003 1.1041 1.1056 1.1032 1.0988 1.0987 1.0892 1.0997 1.0992 1.0899 1.0904 1.0943 1.0911 1.0787
irintensity: 0.0815 0.1354 0.1141 0.6352 2.2315 1.8593 4.3213 8.5922 9.6379 9.5862 4.6858 3.0224 0.6620 1.9950 0.0749 5.2206 4.3185 3.3272 1.2712 1.0969 0.3219 0.3527 0.6091 0.2938 1.2232 1.6729 1.9396 2.7942 1.5808 1.6070 3.0385 1.3346 8.8810 1.3326 12.2215 9.6596 4.6630 0.9833 11.7101 4.4507 21.0834 22.1425 7.4506 84.9231 1.8898 8.7182 2.5587 28.2305 4.1814 5.1645 1.5023 9.0910 9.8133 16.1963 9.9384 30.2813 34.2926 21.6207 4.6169 28.9281 13.1815 11.1147 19.9871 2.3318 6.9759 39.1222 30.5603 52.8338 1.1369 13.7759 2.2325 10.7825 0.0721 0.2742 0.0703 0.1693 124.9785 68.7719 3.0981 60.8966 11.4136 10.1640 149.2752 23.9263 27.9972 54.9109 110.8250 168.7311 83.3749 144.7034 27.5327 24.8286 29.1204 18.3880 10.4988 8.9526 43.4385 5.2699 3.8956 19.1343 62.1389 18.0856 9.3853 10.1304 26.7340 38.6811 10.0574 18.4415 17.1184 39.9717 134.4133 59.9843 29.0721 35.1932 7.0995 349.1138 98.3887 84.9998 17.7905 44.3375 14.8499 15.8725 165.9113 96.2811 41.3162 72.9215 45.3869 22.4915 46.8756 16.3708 43.3849 59.3916 44.6756 6.5384 44.8830 11.7183 4.7653 9.3441 46.5810 8.1810 9.2391 32.8169 13.3710 2.0587 10.5128 2.7316 34.1990
temp: 298.150 k
press: 1.00000 atm
elementType: 35 8 8 8 8 8 7 6 6 6 6 6 6 6 6 6 6 6 6 6 6 6 6 6 6 6 6 1 1 1 1 1 1 1 1 1 1 1 1 1 1 1 1 1 1 1 1 1 1 1 1
symmnumber: 1
zpe: 1061801.0 jmol-1
zpe.correction: 0.404419 hartree
zpe.thermalcorrener: 0.433084 hartree
zpe.thermalcorrenthalpy: 0.434028 hartree
zpe.thermalcorrgfe: 0.339543 hartree
zpe.sumelectzpe: -1218.788209 hartree
zpe.sumelectthermal: -1218.759544 hartree
zpe.sumelectthermalent: -1218.758600 hartree
zpe.sumelectthermalfe: -1218.853085 hartree
dipole: -1.2700 -1.3204 1.3169
dipole: 2.2562
quadrupole: -165.6687 -150.5243 -165.4312
quadrupole: 5.9522 -8.6541 -8.8477
quadrupole: -5.1273 10.0171 -4.8898 5.9522 -8.6541 -8.8477
hfenergy: -1219.1926277 hartree
pointgroup: C01 [X(C20H24Br1N1O5)]
dipole: -0.4383608 -0.47337 0.6096841 debye
polarizability: 304.4732088|-7.741466|274.5018488|-14.4463244|-34.9249921|230.2340825 unknown
InChI: InChI=1S/C20H24BrNO5/c1-24-16-6-5-13(9-17(16)25-2)7-8-22-20(23)11-14-10-18(26-3)19(27-4)12-15(14)21/h5-6,9-10,12,22H,7-8,11H2,1-4H3
charge 0 multiplicity 1
51 atoms
Br -2.810083 -3.736055 -0.169821
O  5.999193 -0.626429 1.685711
O  6.858309 1.454313 0.29034
O  -5.140342 1.980439 0.155628
O  -0.819624 0.352236 -2.909135
O  -5.557882 0.270285 2.142368
N  -0.162004 -1.588425 -1.80043
C  1.372733 -0.25201 -0.304633
C  1.22066 -1.133642 -1.57998
C  2.801512 0.240254 -0.136595
C  -2.523025 -1.381792 -2.496983
C  -3.32186 -1.025698 -1.252062
C  -1.097291 -0.791615 -2.431526
C  3.706103 -0.436801 0.725218
C  3.271974 1.349789 -0.870949
C  5.048383 -0.019297 0.85438
C  -3.863452 0.287382 -1.140399
C  5.513698 1.106933 0.10189
C  -3.542836 -1.893567 -0.165945
C  4.615041 1.780601 -0.753254
C  -4.593722 0.708418 -0.013264
C  -4.814267 -0.211783 1.064863
C  -4.280037 -1.514167 0.978178
C  5.557576 -1.773924 2.477883
C  7.360426 2.599553 -0.470013
C  -4.911803 2.954604 -0.917123
C  -5.795557 -0.648523 3.259041
H  0.677621 0.601198 -0.408272
H  1.052469 -0.836766 0.57891
H  1.5251 -0.542475 -2.460819
H  1.880417 -2.017704 -1.512703
H  -3.00062 -0.938188 -3.386234
H  -2.485197 -2.47553 -2.635763
H  -0.475179 -2.463409 -1.372108
H  3.343833 -1.294423 1.302493
H  2.587213 1.888229 -1.536382
H  -3.672219 0.980011 -1.965508
H  4.952279 2.646909 -1.33007
H  -4.429867 -2.230992 1.78802
H  6.445225 -2.08491 3.048091
H  5.219169 -2.607615 1.830899
H  4.743865 -1.495109 3.176443
H  8.41799 2.68983 -0.181639
H  6.820326 3.530201 -0.205606
H  7.283904 2.425853 -1.561666
H  -3.830887 3.139968 -1.06754
H  -5.367486 2.617814 -1.868458
H  -5.405223 3.874839 -0.573048
H  -6.36691 -1.539374 2.932287
H  -4.843689 -0.966201 3.727932
H  -6.389956 -0.069531 3.980154
