program: Gaussian 09
title: 000288321
version: EM64L-G09RevD.01
frameworkgroup: C1[X(C15H12N2O)]
method: RPBEPBE
basis: SDD
operation: Freq
keyword: #p
keyword: freq=noraman
keyword: PBEPBE/SDD
title: #p freq=noraman PBEPBE/SDD
converged: YES YES NO NO
title: Mulliken charges:
elementType: O N N C C C C C C C C C C C C C C C H H H H H H H H H H H H
charge: -0.254106 0.003838 0.003838 0.439345 0.439345 -0.253721 -0.253721 -0.302994 -0.302994 -0.316120 -0.316120 0.166382 -0.460162 -0.460161 -0.187364 -0.187363 -0.341694 -0.341694 0.264054 0.264054 0.248407 0.248407 0.217935 0.217935 0.247593 0.247592 0.236606 0.236606 0.248137 0.248137
chargesum: 0.00000
title: Mulliken charges with hydrogens summed into heavy atoms:
elementType: O N N C C C C C C C C C C C C C C C
charge: -0.254106 0.003838 0.003838 0.439345 0.439345 0.010333 0.010333 -0.054587 -0.054587 -0.098185 -0.098184 0.166382 -0.212569 -0.212569 0.049242 0.049243 -0.093557 -0.093557
polarizability: 4.54059189e+02 5.87428569e-05 1.70424643e+02 -1.64593320e-04 -1.68137781e-01 6.83103324e+01
1716.lowfreq: -7.6513 -2.8892 -0.0008 0.0006 0.0010 2.4072 17.9296 22.5093 37.7961
frequency: 17.9172 22.2746 37.7961 75.6533 79.5517 104.5935 110.4911 180.0914 194.5247 238.6905 261.0938 263.2354 266.3291 387.6311 389.7182 411.8920 469.5964 486.5245 516.3352 550.7549 590.9366 615.1739 622.3855 676.0484 711.1151 716.7366 727.1639 804.4880 819.6284 825.3840 850.7385 876.3769 915.0751 917.1905 920.5650 945.1127 945.7181 957.2779 986.9440 988.1945 1000.8836 1001.4003 1010.2418 1017.8799 1027.0379 1029.9497 1108.4319 1117.5266 1122.4241 1201.2944 1202.9429 1210.1798 1213.5041 1283.7514 1291.0384 1311.2879 1314.7760 1320.0648 1338.8060 1346.3340 1346.9124 1416.1102 1416.8332 1459.0101 1460.4347 1518.1982 1544.3592 1544.6228 1581.6640 1581.7445 1628.1158 1650.3673 3087.8846 3088.6084 3117.7089 3124.0918 3130.2154 3131.8174 3133.3075 3133.7553 3140.6013 3140.6192 3170.2227 3170.3136
redmass: 4.4700 4.9069 6.3508 3.9286 4.6302 4.3912 5.3800 7.2606 2.5089 5.3615 2.9322 8.6377 2.7944 2.8583 2.9902 4.6448 3.5882 3.9621 4.3127 7.7706 7.0706 7.8075 7.1181 4.3453 1.8423 1.7261 6.7642 1.5651 1.7771 6.2665 4.5287 1.7550 1.7470 1.4283 1.6333 1.4792 1.5024 4.7360 1.3475 1.3664 3.6547 3.6708 1.2258 1.1992 3.2236 3.0498 1.8194 1.6157 2.0053 1.3148 1.3336 1.6203 1.5876 2.1317 1.7081 4.0200 2.7995 1.8658 2.1478 1.2233 1.4317 2.1070 2.1150 2.1698 2.2312 10.2812 5.0246 4.9947 5.6516 5.6762 5.6606 5.6571 1.0895 1.0897 1.0911 1.0909 1.0889 1.0883 1.0901 1.0907 1.0921 1.0921 1.0999 1.0999
irintensity: 0.0001 3.9629 0.1489 4.4541 0.0000 1.0502 5.0168 0.0501 0.0054 1.0228 0.1674 3.2598 0.5606 7.4684 0.0001 1.5236 1.0812 0.0089 1.7932 59.6113 1.6707 6.5801 3.7597 3.2032 0.0008 72.3138 3.6844 0.0000 74.5442 0.7263 3.7478 0.0030 2.2697 0.0130 17.6008 0.0090 0.2309 0.0019 0.0012 5.9061 2.1467 13.3432 0.0079 87.1492 16.6104 0.0517 206.3584 15.1791 87.8982 4.8740 35.7813 44.7125 0.3141 0.2077 44.0199 5.0182 0.4662 0.6607 132.8964 4.9037 139.5448 14.4173 1.4234 13.7244 123.6890 119.1777 55.2753 9.1364 16.8517 4.7294 655.8282 1.0389 0.0738 1.5854 13.4853 4.2815 11.0603 19.8406 6.9117 2.5908 13.7677 12.1355 62.0558 5.4570
temp: 298.150 k
press: 1.00000 atm
elementType: 8 7 7 6 6 6 6 6 6 6 6 6 6 6 6 6 6 6 1 1 1 1 1 1 1 1 1 1 1 1
symmnumber: 1
zpe: 602105.8 jmol-1
zpe.correction: 0.229330 hartree
zpe.thermalcorrener: 0.244800 hartree
zpe.thermalcorrenthalpy: 0.245744 hartree
zpe.thermalcorrgfe: 0.183099 hartree
zpe.sumelectzpe: -762.237802 hartree
zpe.sumelectthermal: -762.222332 hartree
zpe.sumelectthermalent: -762.221388 hartree
zpe.sumelectthermalfe: -762.284033 hartree
dipole: 0.0000 -1.9376 0.0560
dipole: 1.9384
quadrupole: -73.9206 -114.8109 -110.1465
quadrupole: 0.0000 -0.0002 -0.0677
quadrupole: 25.7054 -15.1849 -10.5205 0.0000 -0.0002 -0.0677
hfenergy: -762.4671324 hartree
pointgroup: C01 [X(C15H12N2O1)]
dipole: 0.000003 -0.7579879 0.0841418 debye
polarizability: 454.0591885|0.0011442|169.7174451|0.0004775|-8.4701317|69.01753 unknown
InChI: InChI=1S/C15H12N2O/c18-15(7-5-13-3-1-9-16-11-13)8-6-14-4-2-10-17-12-14/h1-12H
charge 0 multiplicity 1
30 atoms
O  0.000025 -2.202679 0.204655
N  5.25245 1.843872 -0.112634
N  -5.25243 1.843831 -0.112664
C  3.810216 -0.147519 0.053716
C  -3.810182 -0.147548 0.053703
C  2.482193 -0.766716 0.099517
C  -2.482154 -0.766736 0.099508
C  4.97086 -0.969663 0.132409
C  -4.97082 -0.9697 0.132404
C  1.263398 -0.143265 0.052638
C  -1.263364 -0.143275 0.052634
C  0.00002 -0.927687 0.110479
C  4.025282 1.259566 -0.069349
C  -4.025258 1.259534 -0.069376
C  6.250786 -0.381615 0.089419
C  -6.25075 -0.381661 0.08941
C  6.34663 1.023794 -0.032701
C  -6.346604 1.023745 -0.032722
H  2.451645 -1.864478 0.182293
H  -2.451598 -1.864498 0.182285
H  4.858741 -2.056262 0.226243
H  -4.858693 -2.056297 0.226248
H  1.174539 0.947602 -0.02714
H  -1.174514 0.947592 -0.027143
H  3.176735 1.950067 -0.137637
H  -3.176715 1.95004 -0.137674
H  7.156857 -0.992255 0.148462
H  -7.156817 -0.992307 0.14846
H  7.320581 1.524188 -0.069909
H  -7.320558 1.524132 -0.069933
