program: Gaussian 09
title: 000288313
version: EM64L-G09RevD.01
frameworkgroup: C1[X(C3H9N3O)]
method: RPBEPBE
basis: SDD
operation: Freq
keyword: #pfreq=noraman
keyword: PBEPBE/SDD
title: #p freq=noraman PBEPBE/SDD
converged: YES YES NO NO
title: Mulliken charges:
elementType: O N N N C C C H H H H H H H H H
charge: -0.319754 -0.379512 -0.330544 -0.371239 0.282736 -0.595975 -0.602793 0.304058 0.292789 0.333138 0.222394 0.247748 0.207305 0.271845 0.218022 0.219782
chargesum: 0.00000
title: Mulliken charges with hydrogens summed into heavy atoms:
elementType: O N N N C C C
charge: -0.319754 -0.075454 -0.037755 -0.038100 0.282736 0.081471 0.106856
polarizability: 7.37617363e+01 -1.29183135e-01 6.14259547e+01 -2.59125376e+00 2.55256329e+00 4.22483783e+01
1716.lowfreq: -8.0118 -0.0008 -0.0005 0.0009 8.8260 10.5332 75.8326 110.9623 123.6639
frequency: 75.8037 110.9416 123.6567 163.5787 187.9562 242.4386 338.1433 401.2824 495.6667 530.0741 640.4849 668.7982 703.1203 776.8162 852.8874 972.3437 1105.0204 1120.2946 1127.6134 1142.6391 1150.1090 1188.4778 1262.7526 1384.1626 1422.6496 1428.9065 1456.1731 1463.3782 1477.0380 1487.0943 1493.7036 1532.0201 1658.9935 2926.3029 2967.0228 3039.8838 3044.6165 3097.9600 3099.0635 3428.7962 3463.0502 3507.7089
redmass: 2.9906 1.4516 2.0621 3.3527 1.2267 2.3029 3.8909 3.1006 1.3700 2.7466 2.3591 1.3391 7.7466 1.6459 3.0800 2.0790 1.3551 3.3338 1.2938 1.7382 2.6084 1.9763 2.3468 1.3433 1.1796 1.1567 1.2153 1.0970 1.1611 1.0466 1.0655 1.8626 5.5286 1.0481 1.0355 1.1021 1.0841 1.1016 1.0974 1.0763 1.0769 1.0764
irintensity: 2.9693 0.7340 0.6617 4.3538 1.0377 4.7084 27.7666 5.8778 136.1440 52.7536 13.6454 71.0382 34.4360 122.0981 3.5485 3.8577 3.6470 18.5689 0.0646 16.5231 22.9027 17.8652 67.9040 25.9140 24.5161 19.2902 69.6320 10.4250 56.7933 14.8768 5.4999 273.0851 271.3003 98.7738 91.0087 48.7387 35.7777 24.6473 4.7883 0.9380 7.2328 48.8689
temp: 298.150 k
press: 1.00000 atm
elementType: 8 7 7 7 6 6 6 1 1 1 1 1 1 1 1 1
symmnumber: 1
zpe: 351459.4 jmol-1
zpe.correction: 0.133864 hartree
zpe.thermalcorrener: 0.142457 hartree
zpe.thermalcorrenthalpy: 0.143401 hartree
zpe.thermalcorrgfe: 0.100626 hartree
zpe.sumelectzpe: -358.599078 hartree
zpe.sumelectthermal: -358.590485 hartree
zpe.sumelectthermalent: -358.589540 hartree
zpe.sumelectthermalfe: -358.632315 hartree
dipole: 3.8327 -3.0699 -0.7760
dipole: 4.9715
quadrupole: -36.2565 -45.4055 -42.3563
quadrupole: 6.9902 -0.4213 -0.9831
quadrupole: 5.0829 -4.0660 -1.0169 6.9902 -0.4213 -0.9831
hfenergy: -358.7329415 hartree
pointgroup: C01 [X(C3H9N3O1)]
dipole: 1.2309235 -0.6429948 -1.3773515 debye
dipolederiv: -0.7754253 0.0677388 0.2425815 0.0048804 -0.5486776 -0.2512132 0.2137887 -0.2980287 -0.9835773 -0.85331 -0.073575 0.0640297 -0.0897853 -0.517664 0.1965312 0.2225905 0.2749617 -0.1302653 -0.4683195 -0.0220331 -0.1821622 -0.0758021 -0.0650028 -0.0679581 -0.355259 -0.0844219 -0.1645634 -0.9362595 -0.2185938 -0.2448198 -0.2939182 -0.6825237 -0.1745939 -0.3047334 -0.1854961 -0.6489895 1.7757588 0.2459197 -0.255925 0.4909105 0.6808517 0.4968672 -0.0038931 0.5701164 1.2665246 0.3506514 -0.0077642 0.156154 -0.1325924 0.2490542 -0.0113586 0.1940906 0.0111777 0.1593588 0.5824102 0.1560592 0.162373 0.0894986 0.2754705 -0.0705072 -0.0020549 -0.1245487 0.0742553 0.0797395 -0.0356055 0.0046665 0.0099048 0.3048256 -0.0982106 0.0231469 -0.1661156 0.0707445 0.104106 -0.003888 0.18021 0.0493526 0.0440294 0.0869978 0.1426485 0.0199558 0.1486345 0.2974436 -0.0457334 0.019386 -0.0262931 0.2825941 -0.0689507 0.0126674 -0.0779809 0.1932865 0.0026231 0.0741975 0.0620805 0.0858406 0.0628464 -0.066476 0.1122832 -0.0885127 -0.0939069 0.0293227 -0.0991795 0.0486358 -0.0406429 -0.0353927 0.0755398 0.0034147 0.108633 0.0475502 -0.1730463 0.0111725 -0.1174306 -0.0618921 -0.0093269 -0.0794566 -0.2047029 -0.0196763 -0.0163006 0.1084351 0.0001172 0.0085108 0.063847 0.1164987 -0.0579167 0.1263828 -0.0232964 0.0126365 -0.0157964 -0.0412745 -0.0280948 -0.1197055 -0.2028844 -0.0054448 -0.0135456 0.0024116 0.1164657 -0.1083336 -0.0075579 -0.1201956 0.0463969 0.0453015 0.0961503 -0.1668245 0.080821 -0.0518536 unknown
polarizability: 72.6956029|2.2755928|47.872301|-4.6903504|8.9612865|56.8681653 unknown
InChI: InChI=1S/C3H9N3O/c1-4-3(7)6-5-2/h4-6H,1-2H3
charge 0 multiplicity 1
16 atoms
O  -1.030304 1.462331 1.922257
N  0.825222 1.294762 0.52384
N  1.458149 0.681475 -0.585194
N  -1.185776 0.263212 -0.102909
C  -0.522962 1.017376 0.846276
C  2.455757 -0.359572 -0.234903
C  -2.596513 -0.08792 0.039939
H  1.370124 1.747156 1.267278
H  1.820778 1.387089 -1.240624
H  -0.632089 -0.015893 -0.917981
H  2.883852 -0.766903 -1.168248
H  1.950256 -1.178352 0.30387
H  3.287529 0.017014 0.401832
H  -2.946801 0.319895 1.002556
H  -2.744246 -1.184701 0.045431
H  -3.210774 0.348033 -0.771421
