program: Gaussian 09
title: 000288362
version: EM64L-G09RevD.01
frameworkgroup: C1[X(C20H32O2)]
method: RPBEPBE
basis: SDD
operation: Freq
keyword: #pfreq=noraman
keyword: PBEPBE/SDD
title: #p freq=noraman PBEPBE/SDD
converged: NO YES NO NO
title: Mulliken charges:
elementType: O O C C C C C C C C C C C C C C C C C C C C H H H H H H H H H H H H H H H H H H H H H H H H H H H H H H H H
charge: -0.428160 -0.223588 0.373937 -0.207229 -0.208060 0.289910 -0.511739 0.516056 -0.493529 -0.531862 -0.474179 0.459037 -0.472830 -0.710091 -0.833878 -0.521599 -0.517827 -0.780515 0.064582 -0.416074 -0.798588 -0.741498 0.257730 0.189955 0.222340 0.218794 0.235766 0.202516 0.229235 0.228003 0.195588 0.228426 0.230946 0.199530 0.217681 0.206344 0.247121 0.218014 0.222936 0.190482 0.213840 0.217881 0.242830 0.234581 0.224986 0.195845 0.199743 0.231763 0.208416 0.217344 0.224319 0.225407 0.213365 0.375998
chargesum: 0.00000
title: Mulliken charges with hydrogens summed into heavy atoms:
elementType: O O C C C C C C C C C C C C C C C C C C C C
charge: -0.052162 -0.223588 0.373937 0.050501 -0.018105 0.289910 -0.070605 0.516056 -0.055247 -0.074624 -0.050166 0.459037 -0.042353 -0.286067 -0.145807 -0.117278 -0.299946 -0.078118 0.064582 -0.020486 -0.141064 -0.078407
polarizability: 2.60831332e+02 5.25226437e+00 1.96788224e+02 5.82514404e+00 2.70151212e+00 1.79599216e+02
1716.lowfreq: -5.8736 -0.0008 -0.0001 0.0003 8.6873 20.1198 46.9576 59.5039 83.3021
frequency: 46.2191 58.9410 83.2861 94.4270 102.9873 117.1110 132.6203 168.6325 175.1980 207.5791 214.8849 228.9388 234.2546 250.6165 258.7837 270.6297 280.1035 293.9748 299.3230 304.2545 310.5590 321.1468 334.0610 353.4330 364.4616 378.0828 399.3047 405.5599 413.7487 456.4535 466.9658 472.5338 502.1527 516.4223 527.1428 573.3752 589.0368 599.9765 638.5040 670.3671 690.2713 714.3518 727.4613 745.8895 776.0752 785.9044 821.1316 829.1052 845.9926 866.9898 873.1782 892.1306 898.0947 913.4793 915.3671 952.3351 957.3649 963.1871 975.1558 992.3035 997.8487 1005.8208 1016.3505 1020.6862 1029.0680 1037.4850 1051.5052 1062.6499 1073.7307 1078.3520 1093.0362 1102.5181 1120.6294 1134.5436 1145.5398 1149.9132 1162.6279 1166.7251 1180.2132 1194.9404 1206.5890 1211.0111 1225.1690 1236.0763 1242.8669 1260.5560 1269.7265 1279.1759 1289.0378 1297.6413 1307.5582 1310.5424 1319.4093 1325.5988 1332.0254 1336.1307 1338.9542 1340.7605 1343.5521 1347.3929 1358.3279 1371.6762 1384.1065 1385.5083 1393.1914 1396.8470 1448.1462 1454.2138 1456.5174 1458.9881 1461.7825 1469.2051 1471.6449 1474.5674 1475.6984 1479.7860 1486.1695 1487.2082 1490.3351 1491.3512 1494.8775 1507.1092 1637.9437 1702.6907 2895.8180 2925.8449 2947.8601 2951.3261 2956.3432 2968.6521 2971.7170 2980.4325 2982.2334 2985.2800 2985.7561 2987.8600 2993.0173 2994.6751 2999.9541 3009.0919 3020.3468 3020.9526 3029.2299 3040.8406 3045.1635 3055.6410 3060.0028 3064.1766 3069.0287 3075.1461 3078.1427 3079.1716 3087.1590 3100.2660 3100.3681 3511.1508
redmass: 3.8768 3.1358 7.4863 3.3349 3.0477 3.6184 2.5727 3.2018 1.7186 1.6709 2.4877 3.1068 2.0445 2.1034 1.3166 1.8816 1.8984 2.5277 2.4572 1.7870 1.9427 1.5252 2.1005 2.7035 2.2195 2.8323 2.6662 2.0487 2.9332 2.9725 2.8633 3.5871 3.1041 3.4580 2.7926 2.9347 1.5804 2.0939 2.3843 3.6929 3.0569 2.4649 4.5089 2.5694 1.2106 2.2583 1.6047 2.3586 1.7581 1.8472 1.9310 1.8294 2.3339 2.0537 1.7640 1.9602 1.7629 1.7837 1.7365 1.8132 1.8930 2.0765 2.0486 2.1487 1.8816 2.1908 2.9380 2.1790 1.8761 1.9532 1.5405 2.2463 1.9840 1.7074 2.0308 2.0118 1.7814 1.6307 2.4436 1.7975 1.5982 1.6079 1.7559 1.4488 1.7321 1.5944 1.5983 1.4530 1.3181 1.4060 1.6364 1.3841 1.3836 1.4432 1.4540 1.5793 1.5360 1.4721 1.4159 1.5113 1.4376 1.7142 1.2306 1.1964 1.2086 1.1928 1.0893 1.0832 1.0788 1.0864 1.0674 1.0690 1.0735 1.0632 1.0584 1.0797 1.0500 1.0610 1.0600 1.0667 1.0608 1.0532 8.2819 7.6047 1.0803 1.0645 1.0616 1.0603 1.0652 1.0616 1.0370 1.0361 1.0446 1.0446 1.0507 1.0586 1.0733 1.0711 1.1002 1.0953 1.0929 1.0958 1.0974 1.0988 1.1002 1.1013 1.0985 1.0981 1.0984 1.0986 1.0985 1.0991 1.0906 1.0992 1.0965 1.0639
irintensity: 0.0227 0.2308 0.6806 0.2912 0.1581 0.1756 0.0526 0.0656 0.1872 0.1379 0.3437 0.0862 1.1569 0.5974 0.0376 0.3008 0.8129 0.9950 0.4594 0.1695 0.8221 0.4075 0.3643 4.3806 0.2555 0.5582 0.8620 0.2528 2.1838 3.0295 3.0820 1.0818 0.3265 4.3572 8.3323 10.1036 65.7564 57.5829 7.0653 6.6405 0.9761 0.8277 21.9579 15.6648 5.4225 0.9887 14.5697 2.3736 13.2358 4.0421 1.4303 1.5455 0.0385 0.5752 1.8106 21.1488 11.0232 3.6999 2.6325 2.6780 18.2038 71.4308 92.4182 6.2681 34.2378 8.3106 3.1365 2.7401 31.9649 0.6488 1.9243 1.2778 1.5387 3.6438 6.1217 17.6295 7.0623 0.6830 0.3233 5.6141 3.2077 0.9662 0.1607 1.2581 7.0316 1.0741 7.6077 2.5754 0.6692 1.9171 3.4766 1.1341 4.4386 3.0751 0.1161 2.7766 2.0348 1.2118 1.0868 1.9091 2.8134 2.3242 14.9631 14.2043 22.8147 19.3306 4.8728 1.5488 5.0554 15.5128 2.8999 9.7843 3.8770 7.5448 13.5570 18.0023 15.6928 6.8546 17.9482 12.3768 6.9678 7.5397 182.5802 3.1376 22.0358 28.5269 31.1558 69.3995 27.9809 35.4687 18.1030 38.7714 17.9831 12.9252 19.2897 52.4796 49.2578 5.9609 9.9982 47.4153 37.7654 47.3581 21.7768 36.8557 47.6840 39.4746 25.4546 30.2646 69.3880 37.1930 33.6139 42.8107 41.3584 25.6935 22.3825 22.2414
temp: 298.150 k
press: 1.00000 atm
elementType: 8 8 6 6 6 6 6 6 6 6 6 6 6 6 6 6 6 6 6 6 6 6 1 1 1 1 1 1 1 1 1 1 1 1 1 1 1 1 1 1 1 1 1 1 1 1 1 1 1 1 1 1 1 1
symmnumber: 1
zpe: 1256714.9 jmol-1
zpe.correction: 0.478657 hartree
zpe.thermalcorrener: 0.500751 hartree
zpe.thermalcorrenthalpy: 0.501695 hartree
zpe.thermalcorrgfe: 0.430806 hartree
zpe.sumelectzpe: -930.045891 hartree
zpe.sumelectthermal: -930.023797 hartree
zpe.sumelectthermalent: -930.022853 hartree
zpe.sumelectthermalfe: -930.093742 hartree
dipole: -1.2225 0.8790 -0.5917
dipole: 1.6178
quadrupole: -142.9282 -135.9665 -132.2635
quadrupole: 6.5919 -3.1777 3.1220
quadrupole: -5.8755 1.0862 4.7892 6.5919 -3.1777 3.1220
hfenergy: -930.5245481 hartree
pointgroup: C01 [X(C20H32O2)]
dipole: -0.4854885 -0.3676841 0.1850544 debye
polarizability: 260.8364952|-5.0873528|195.9511427|-5.8119849|4.7359458|180.431134 unknown
InChI: InChI=1S/C20H32O2/c1-5-18(2)12-9-15-14(13-18)7-8-16-19(15,3)10-6-11-20(16,4)17(21)22/h7,15-16,21H,5-6,8-13H2,1-4H3
charge 0 multiplicity 1
54 atoms
O  3.642869 -0.133312 2.166029
O  4.665634 1.213636 0.591914
C  0.723328 0.640986 0.072773
C  1.540276 -0.70227 0.223082
C  -0.791616 0.393496 0.46561
C  3.064351 -0.549506 -0.169535
C  0.884018 1.15378 -1.393136
C  -1.354033 -0.98723 0.147967
C  -1.76307 1.472175 -0.107872
C  0.897744 -1.855218 -0.60106
C  3.212463 0.065991 -1.590042
C  -3.80109 -0.121284 0.013876
C  2.364663 1.339242 -1.807468
C  -2.808212 -1.208948 0.538022
C  1.231254 1.728326 1.067196
C  -3.212368 1.272601 0.386865
C  -0.589344 -1.98238 -0.36848
C  3.803952 -1.930637 -0.129873
C  3.847411 0.29826 0.841967
C  -5.170149 -0.343441 0.728429
C  -3.964673 -0.266285 -1.521679
C  -6.316314 0.607995 0.319656
H  1.497296 -1.002446 1.289512
H  -0.845807 0.501139 1.575556
H  0.362068 2.122122 -1.509112
H  0.389888 0.444817 -2.088294
H  -1.748721 1.434127 -1.212591
H  -1.416959 2.484074 0.179986
H  1.372006 -2.813599 -0.31598
H  1.105883 -1.730217 -1.684411
H  2.91049 -0.703487 -2.327267
H  4.278491 0.291501 -1.777872
H  2.817186 2.177366 -1.245562
H  2.411866 1.625051 -2.87654
H  -3.141291 -2.211511 0.203189
H  -2.872629 -1.208049 1.64965
H  2.2187 2.140304 0.80407
H  0.527967 2.581516 1.087367
H  1.294841 1.318749 2.091978
H  -3.238109 1.382266 1.492781
H  -3.854053 2.074208 -0.028236
H  -1.049809 -2.955952 -0.592997
H  3.626893 -2.452309 0.826449
H  3.463176 -2.573208 -0.958815
H  4.893778 -1.78668 -0.250915
H  -5.007116 -0.259208 1.823675
H  -5.490938 -1.3903 0.542386
H  -2.985076 -0.311609 -2.029815
H  -4.506823 -1.199771 -1.767509
H  -4.531994 0.579466 -1.952212
H  -6.065219 1.664869 0.523888
H  -6.557841 0.517943 -0.754882
H  -7.23572 0.37114 0.886644
H  4.218888 0.412708 2.767136
