program: Gaussian 09
title: 000288301
version: EM64L-G09RevD.01
frameworkgroup: C1[X(C12H11N3O3)]
method: RPBEPBE
basis: SDD
operation: Freq
keyword: #p
keyword: freq=noraman
keyword: PBEPBE/SDD
title: #p freq=noraman PBEPBE/SDD
converged: YES YES NO NO
title: Mulliken charges:
elementType: O O O N N N C C C C C C C C C C C C H H H H H H H H H H H
charge: -0.231832 -0.156285 -0.189183 -0.161243 0.049857 0.067359 -0.397902 -0.412639 -0.294233 -0.298075 0.455499 -0.040827 -0.522224 -0.007998 -0.040717 0.064357 -0.272054 -0.260873 0.284878 0.235821 0.254479 0.236738 0.233650 0.199970 0.210791 0.232156 0.251973 0.254033 0.254524
chargesum: 0.00000
title: Mulliken charges with hydrogens summed into heavy atoms:
elementType: O O O N N N C C C C C C C C C C C C
charge: -0.231832 -0.156285 -0.189183 -0.161243 0.049857 0.067359 0.122797 0.078577 0.139388 0.144872 0.455499 -0.040827 -0.270251 -0.007998 -0.040717 0.064357 -0.018021 -0.006349
polarizability: 2.64614111e+02 1.54928811e+01 1.77038506e+02 1.41064255e+01 2.13285949e+00 8.45575768e+01
1716.lowfreq: -7.1235 -0.0006 -0.0004 -0.0001 4.6071 10.6460 28.3986 44.9063 57.3133
frequency: 27.9248 44.8790 57.1199 71.3626 128.8551 156.0784 197.4270 222.5689 270.9486 280.2377 317.9625 350.9985 370.2304 380.2066 418.5147 435.3277 446.4138 456.4802 464.9373 499.1686 520.9490 590.2790 613.1631 672.5102 683.8331 703.8370 746.7471 787.4889 804.1348 828.6242 831.2254 843.5036 871.3595 875.1760 897.5772 960.5963 964.3395 1000.9337 1021.2045 1041.9746 1046.7134 1064.2196 1067.3824 1106.6259 1136.0273 1174.5597 1188.1843 1215.1747 1236.9193 1246.3893 1263.9051 1268.5052 1307.8124 1320.4309 1329.2668 1336.8034 1342.4972 1359.9392 1364.5643 1411.7823 1418.6516 1447.1236 1457.2193 1462.4002 1475.1646 1492.0244 1494.8219 1531.5281 1572.1667 1584.8618 2954.4932 2961.1865 3004.4117 3012.8914 3087.6669 3090.5028 3100.6104 3137.7003 3142.3974 3161.7489 3162.7797
redmass: 7.4942 5.6165 3.8840 6.8540 5.2029 5.1332 3.6685 3.9803 3.8268 8.9986 3.7639 4.0410 6.9502 3.4612 6.1240 8.1964 2.5729 4.1380 4.9247 5.2875 4.1109 2.9775 3.2276 7.1332 3.7531 6.0791 6.9300 4.6300 4.5741 1.8553 1.8370 4.4020 1.3789 4.1973 2.4099 3.3472 1.6191 2.9780 2.5452 4.2684 2.8969 2.9697 2.8568 2.2567 4.8665 2.3505 1.1261 1.6870 1.3492 6.7412 1.8674 1.4740 1.8576 1.2234 1.6176 1.4234 1.6388 1.3380 2.7459 2.5761 2.8938 1.0838 1.0948 1.0865 1.1450 6.6785 5.2054 8.4650 8.8378 7.8935 1.0679 1.0675 1.0659 1.0688 1.0961 1.0986 1.0972 1.0886 1.0945 1.0984 1.0897
irintensity: 3.1575 1.6710 1.6554 0.0619 3.9156 0.1456 2.1533 2.7563 9.2091 1.2140 7.2661 7.0697 16.5046 2.0875 11.4141 1.3732 4.3269 2.9424 1.0679 8.6120 2.6738 7.4501 3.9449 1.8870 0.2376 1.0169 4.0941 19.5664 6.5307 25.0865 21.7309 6.4037 9.3366 11.8540 3.2005 100.0850 10.8295 13.4926 18.5362 5.0359 39.8181 18.2197 37.6839 41.2571 4.6143 25.6288 4.8669 126.3761 7.6364 16.7578 46.0481 8.4864 90.0357 2.8723 3.4867 1.8088 2.6856 16.8320 2.9237 11.9795 11.7243 4.2163 14.6890 14.7202 21.9625 47.4373 40.9466 11.0595 486.5008 179.3475 40.1180 38.9524 26.4122 62.9370 29.0191 40.6595 7.1758 1.1831 10.3296 46.9245 3.6741
temp: 298.150 k
press: 1.00000 atm
elementType: 8 8 8 7 7 7 6 6 6 6 6 6 6 6 6 6 6 6 1 1 1 1 1 1 1 1 1 1 1
symmnumber: 1
zpe: 570601.7 jmol-1
zpe.correction: 0.217331 hartree
zpe.thermalcorrener: 0.231877 hartree
zpe.thermalcorrenthalpy: 0.232821 hartree
zpe.thermalcorrgfe: 0.174452 hartree
zpe.sumelectzpe: -852.448599 hartree
zpe.sumelectthermal: -852.434053 hartree
zpe.sumelectthermalent: -852.433109 hartree
zpe.sumelectthermalfe: -852.491478 hartree
dipole: -2.1040 -1.8119 0.1949
dipole: 2.7835
quadrupole: -93.4998 -120.7668 -102.5229
quadrupole: -14.0461 5.3317 -5.4585
quadrupole: 12.0967 -15.1703 3.0736 -14.0461 5.3317 -5.4585
hfenergy: -852.6659295 hartree
pointgroup: C01 [X(C12H11N3O3)]
dipole: 0.8618863 -0.5809131 0.3448546 debye
polarizability: 264.1285229|3.0889511|146.2275861|25.064938|-42.1677934|115.8540852 unknown
InChI: InChI=1S/C12H11N3O3/c16-9-7-8(15-3-5-18-6-4-15)12(17)11-10(9)13-1-2-14-11/h1-2,7H,3-6H2
charge 0 multiplicity 1
29 atoms
O  4.660245 -0.191955 -0.523054
O  0.110494 -1.444093 1.819876
O  -1.669965 2.317979 -1.766708
N  2.031111 0.296539 0.594112
N  -2.474363 -1.70445 0.856536
N  -3.510552 0.396246 -0.794348
C  2.800931 -0.916987 0.986172
C  2.952847 1.408417 0.258223
C  3.760085 -1.301035 -0.165473
C  3.886475 1.000186 -0.90426
C  0.693815 0.316193 0.230185
C  -0.248004 -0.68209 0.878362
C  0.150255 1.290494 -0.615001
C  -1.67948 -0.684633 0.4007
C  -2.188038 0.346943 -0.441228
C  -1.252155 1.40289 -0.982528
C  -3.781412 -1.661153 0.482028
C  -4.29875 -0.607474 -0.318648
H  2.124527 -1.744934 1.231365
H  3.388318 -0.676015 1.892386
H  3.577159 1.596479 1.152868
H  2.395843 2.330223 0.033024
H  4.421981 -2.125851 0.144985
H  3.172672 -1.61402 -1.056043
H  3.29621 0.79909 -1.823755
H  4.632347 1.784773 -1.110112
H  0.784705 2.039363 -1.097809
H  -4.421042 -2.478923 0.829558
H  -5.35936 -0.5686 -0.588812
