program: Gaussian 09
title: 000288361
version: EM64L-G09RevD.01
frameworkgroup: C1[X(C21H34O2)]
method: RPBEPBE
basis: SDD
operation: Freq
keyword: #pfreq=noraman
keyword: PBEPBE/SDD
title: #p freq=noraman PBEPBE/SDD
converged: NO YES NO NO
title: Mulliken charges:
elementType: O O C C C C C C C C C C C C C C C C C C C C C H H H H H H H H H H H H H H H H H H H H H H H H H H H H H H H H H H
charge: -0.279657 -0.227170 0.242683 -0.158609 0.258310 0.200761 -0.486233 -0.541275 0.198094 -0.460405 -0.559839 -0.450414 0.455701 -0.579456 -0.616298 -0.836133 -0.514469 -0.789290 0.127873 -0.428479 -0.807345 -0.740930 -0.507014 0.244419 0.216707 0.195162 0.221194 0.220802 0.222764 0.197586 0.213215 0.216636 0.239333 0.195301 0.217302 0.227909 0.215931 0.212648 0.252875 0.221754 0.238493 0.202323 0.202948 0.225108 0.239087 0.226225 0.198939 0.198005 0.212428 0.209710 0.239557 0.217508 0.232443 0.213988 0.238675 0.229896 0.242725
chargesum: 0.00000
title: Mulliken charges with hydrogens summed into heavy atoms:
elementType: O O C C C C C C C C C C C C C C C C C C C C C
charge: -0.279657 -0.227170 0.242683 0.085810 0.258310 0.200761 -0.074364 -0.099278 0.198094 -0.040055 -0.129989 -0.015780 0.455701 -0.134245 -0.187719 -0.123011 -0.109198 -0.098870 0.127873 -0.031534 -0.145651 -0.076992 0.204281
polarizability: 2.63435111e+02 1.92538623e+00 1.99765922e+02 8.19522100e+00 6.02366100e+00 2.05641184e+02
1716.lowfreq: -0.0005 0.0005 0.0007 1.5423 8.9570 14.9038 32.9847 48.6461 74.2575
frequency: 32.9432 48.6134 74.2303 79.2888 84.9024 96.5996 113.7919 117.1010 141.0085 162.4395 171.1344 188.7589 199.5006 209.9096 222.2386 232.7878 245.8879 251.3356 268.8322 278.0898 288.7625 299.7191 306.4162 323.5710 324.5317 327.5105 351.6456 355.0554 373.6346 392.8766 399.8704 424.7889 446.9873 453.0521 467.0395 499.6589 506.1631 518.1165 550.4196 599.9812 626.2039 651.8144 672.2439 722.4368 734.0105 739.8466 769.9992 779.9587 814.2617 845.4991 847.6435 859.7431 872.1404 883.7266 899.9757 907.8162 927.6527 943.1997 952.6195 961.4889 972.3396 979.3942 994.7770 1004.1791 1016.8475 1022.3264 1031.9130 1041.3352 1047.7055 1058.7944 1073.9738 1079.3342 1087.3856 1104.5658 1110.4766 1113.7589 1123.4464 1137.8035 1144.5703 1147.4445 1153.5440 1170.9578 1172.2902 1195.9375 1197.0738 1210.0475 1219.9766 1226.5145 1232.2440 1241.8632 1258.9748 1271.3578 1286.2511 1300.7710 1304.3991 1311.3399 1326.7778 1331.5783 1333.8249 1336.8225 1338.9273 1343.2586 1349.1170 1353.7005 1368.4679 1375.2069 1380.2885 1387.0879 1387.5889 1420.1059 1447.9081 1452.0867 1452.2690 1453.5771 1455.5760 1459.0978 1460.5768 1464.5823 1466.8151 1468.9301 1470.4347 1474.5673 1478.2970 1482.9871 1485.2449 1487.4032 1490.2999 1497.0266 1504.7800 1616.4441 1684.1665 2922.9865 2936.2144 2949.2532 2957.7854 2962.3857 2970.5017 2973.0565 2973.9147 2976.1742 2978.8703 2980.8166 2982.1312 2983.8889 2988.2884 2994.8329 3000.1666 3000.4497 3001.0752 3002.8303 3020.8987 3028.0418 3042.4860 3054.7664 3059.1441 3060.5101 3069.0999 3071.2282 3074.3951 3078.1858 3080.4478 3090.4725 3095.6295 3100.6917 3144.0353
redmass: 3.8506 3.0006 3.7500 2.4660 3.0621 2.2137 2.5783 1.4576 2.4822 2.8943 2.7153 2.2841 1.3159 2.3455 1.6760 1.7707 2.0988 1.3214 2.2686 1.8873 2.1542 2.0573 2.8023 1.9914 2.1083 2.3056 2.2939 3.8750 1.9354 2.7599 3.1118 2.8090 3.0007 3.0548 2.8593 2.6088 3.1097 3.2047 2.7209 3.1581 3.0810 2.9225 2.8099 5.3969 2.8818 3.4715 1.2904 2.4672 2.0087 2.0033 1.8214 1.8085 2.0568 2.0332 1.8873 2.3432 1.7675 2.9348 2.4620 1.9623 1.6814 1.6348 2.0846 1.9916 1.6590 1.8939 2.0542 1.8084 1.8820 3.1635 2.0591 2.2250 1.7821 2.3694 2.5718 1.3166 1.5945 1.5833 1.5638 1.5441 2.0127 2.1528 1.8184 2.0473 2.4838 1.8012 1.7635 2.3074 1.5121 1.3753 1.5970 1.7547 1.2874 1.4226 1.3922 1.4921 1.5086 1.5452 1.4492 1.4353 1.5142 1.4578 1.6044 1.5035 1.8272 1.2372 1.2053 1.2049 1.1960 1.1758 1.0818 1.0583 1.0808 1.0808 1.0889 1.0725 1.0661 1.0556 1.0651 1.0692 1.0668 1.0809 1.0496 1.0739 1.0714 1.0582 1.0711 1.0569 1.0554 9.4330 7.4036 1.0620 1.0626 1.0594 1.0578 1.0630 1.0383 1.0902 1.0714 1.0717 1.0618 1.0379 1.0570 1.0649 1.0397 1.0635 1.0682 1.0577 1.0689 1.0975 1.1021 1.0999 1.0979 1.0996 1.1001 1.0989 1.0985 1.0989 1.0980 1.0992 1.0982 1.0967 1.1010 1.1041 1.1047
irintensity: 0.0389 0.3151 1.4028 0.1880 0.1173 0.2379 0.0700 0.2459 0.2766 1.1732 0.7523 1.9643 0.3329 2.9392 0.1159 1.6389 2.1322 0.5338 1.1948 2.5762 1.0249 0.1637 4.0839 1.0490 1.8512 0.5911 0.6917 8.5006 3.9034 0.4836 1.2905 0.7227 1.9556 1.9995 0.2800 1.0110 0.7970 0.6077 2.6845 0.6060 0.8334 1.0250 2.0631 7.4911 1.8607 2.0677 5.3816 1.9864 9.5508 2.2485 2.3886 9.3201 5.5925 4.1219 2.9124 0.8737 0.8310 1.8145 7.2040 8.4354 4.6576 10.1605 1.5286 5.0737 14.0594 11.3772 1.9435 40.4655 33.2139 2.6096 12.1352 2.7576 14.8772 94.1802 27.7299 7.8629 1.1954 5.2268 23.2323 1.3850 8.0709 10.5364 39.0722 3.3758 3.3852 3.3530 9.3847 4.9897 9.7948 0.8593 1.2369 0.3837 1.1136 0.7453 2.1439 2.0715 5.0461 2.6498 2.1098 0.3097 2.1670 0.7378 4.9451 3.6928 2.7455 18.0599 8.8073 22.9406 16.5818 14.3289 2.1961 18.0094 6.0639 1.0665 1.4596 7.5133 6.6045 5.3505 8.9464 25.7396 9.1070 1.9885 11.0515 23.1575 14.4329 13.4999 2.6192 5.8651 7.9188 134.0906 0.0978 29.5164 66.1070 15.9497 65.1767 36.3684 27.4240 17.0176 36.6819 3.4818 7.6869 46.0321 20.3033 37.7117 26.5979 35.9218 35.3543 48.8388 48.1942 12.8291 70.2753 37.6138 29.0425 35.7068 48.3207 31.6625 78.2839 18.8143 32.1801 55.3214 32.3218 36.6680 21.9988 28.4060 14.7390
temp: 298.150 k
press: 1.00000 atm
elementType: 8 8 6 6 6 6 6 6 6 6 6 6 6 6 6 6 6 6 6 6 6 6 6 1 1 1 1 1 1 1 1 1 1 1 1 1 1 1 1 1 1 1 1 1 1 1 1 1 1 1 1 1 1 1 1 1 1
symmnumber: 1
zpe: 1326532.2 jmol-1
zpe.correction: 0.505249 hartree
zpe.thermalcorrener: 0.529554 hartree
zpe.thermalcorrenthalpy: 0.530499 hartree
zpe.thermalcorrgfe: 0.454025 hartree
zpe.sumelectzpe: -969.264042 hartree
zpe.sumelectthermal: -969.239737 hartree
zpe.sumelectthermalent: -969.238793 hartree
zpe.sumelectthermalfe: -969.315266 hartree
dipole: -1.0826 0.2048 -1.3463
dipole: 1.7397
quadrupole: -149.0702 -134.9267 -141.7069
quadrupole: 2.1916 -8.2756 -1.6886
quadrupole: -7.1689 6.9746 0.1944 2.1916 -8.2756 -1.6886
hfenergy: -969.7692916 hartree
pointgroup: C01 [X(C21H34O2)]
dipole: 0.4203996 -0.5393264 -0.0295124 debye
polarizability: 263.2174366|-8.19071|203.2258409|-3.9441828|6.7935161|202.3989402 unknown
InChI: InChI=1S/C21H34O2/c1-6-19(2)13-10-16-15(14-19)8-9-17-20(16,3)11-7-12-21(17,4)18(22)23-5/h17H,6-14H2,1-5H3
charge 0 multiplicity 1
57 atoms
O  -3.293247 -1.499263 1.246124
O  -4.46666 0.485768 0.998567
C  -0.518181 0.694024 0.155039
C  -1.283743 -0.479892 -0.57623
C  -2.831424 -0.208781 -0.764944
C  1.020127 0.477246 0.096452
C  -0.857993 2.063271 -0.53253
C  -0.583445 -0.817435 -1.916727
C  1.622583 -0.456398 -0.69978
C  -3.089169 1.186073 -1.39889
C  0.837081 -1.342868 -1.650465
C  -2.373836 2.333833 -0.656607
C  3.943598 -0.041617 0.40585
C  1.872493 1.373237 0.997647
C  3.1299 -0.693542 -0.744552
C  -0.936889 0.749971 1.657544
C  3.36573 1.387065 0.612545
C  -3.503665 -1.306754 -1.655976
C  -3.599019 -0.311428 0.568082
C  5.447259 0.093339 0.014591
C  3.794763 -0.873078 1.70718
C  6.179499 -1.216903 -0.350194
C  -4.026472 -1.718155 2.513767
H  -1.196374 -1.380374 0.065725
H  -0.401469 2.077208 -1.542296
H  -0.382116 2.885696 0.035878
H  -0.528171 0.07741 -2.566429
H  -1.14919 -1.58593 -2.471679
H  -4.177978 1.375885 -1.430215
H  -2.730913 1.151132 -2.447146
H  1.393763 -1.432957 -2.607108
H  0.786141 -2.374701 -1.23822
H  -2.833315 2.472032 0.339142
H  -2.532582 3.281271 -1.207897
H  1.486176 2.411704 0.97305
H  1.771365 1.048727 2.054023
H  3.310006 -1.78967 -0.759762
H  3.513565 -0.321668 -1.721563
H  -2.010352 0.962864 1.786731
H  -0.714204 -0.209223 2.160005
H  -0.395398 1.551606 2.188937
H  3.494001 1.956384 -0.331274
H  3.947143 1.918845 1.393071
H  -3.216413 -1.177116 -2.713386
H  -3.219595 -2.321026 -1.326408
H  -4.605037 -1.220985 -1.601911
H  5.981905 0.583273 0.855358
H  5.517477 0.791849 -0.845903
H  4.254175 -1.872732 1.599637
H  4.284478 -0.363636 2.55947
H  2.73149 -1.027182 1.962642
H  6.199785 -1.926771 0.496467
H  5.70104 -1.72517 -1.207113
H  7.228336 -1.008689 -0.631911
H  -3.764384 -0.933757 3.244549
H  -3.698121 -2.707729 2.861924
H  -5.115228 -1.695982 2.338421
