program: Gaussian 09
title: 000288296
version: EM64L-G09RevD.01
frameworkgroup: C1[X(C10H12N4O)]
method: RPBEPBE
basis: SDD
operation: Freq
keyword: #p
keyword: freq=noraman
keyword: PBEPBE/SDD
title: #p freq=noraman PBEPBE/SDD
converged: YES YES NO NO
title: Mulliken charges:
elementType: O N N N N C C C C C C C C C C H H H H H H H H H H H H
charge: -0.258387 -0.239377 -0.002860 -0.069080 -0.441076 -0.408238 0.449642 -0.512708 -0.347666 -0.367803 0.507948 -0.470230 -0.332065 0.208780 -0.800735 0.245040 0.245562 0.252318 0.252284 0.236588 0.276962 0.216928 0.310425 0.307134 0.235283 0.269684 0.235646
chargesum: 0.00000
title: Mulliken charges with hydrogens summed into heavy atoms:
elementType: O N N N N C C C C C C C C C C
charge: -0.258387 -0.239377 -0.002860 -0.069080 -0.133942 0.082363 0.449642 -0.008106 -0.111078 -0.090841 0.507948 -0.253301 -0.021641 0.208780 -0.060122
polarizability: 2.77392715e+02 4.77538457e+00 1.34951157e+02 -2.09901541e-03 -2.79728495e-02 6.82644697e+01
1716.lowfreq: -85.3228 -5.5043 0.0004 0.0007 0.0009 4.1583 9.1185 38.7924 55.1784
frequency: -85.3223 38.7909 55.1126 77.4230 97.8868 99.6076 138.6565 182.5488 195.5351 250.7468 323.4053 373.9776 405.2194 410.9688 444.4898 497.9863 522.9971 556.5138 580.2475 630.9347 634.9635 677.1072 722.9203 779.2930 790.5770 805.0756 821.2417 829.4311 866.6377 867.9348 924.7258 928.8717 966.2310 983.0062 995.2730 1000.6854 1010.9619 1028.6495 1041.4358 1061.1184 1131.4457 1140.0043 1191.9792 1212.8116 1218.8956 1255.0487 1263.5486 1296.0252 1311.5290 1359.7843 1370.3459 1374.6244 1407.1309 1428.2094 1449.5397 1461.4360 1468.0252 1492.7564 1503.3699 1515.7139 1587.6313 1631.9013 1632.5021 2985.4758 2988.7911 3033.8288 3042.5871 3070.2823 3095.0870 3110.9830 3135.3132 3156.4627 3175.9297 3198.2777 3520.7027
redmass: 1.0538 4.4936 5.0901 4.1922 4.4082 5.4758 1.9050 5.1517 5.3492 5.1053 5.8745 5.3876 4.3721 3.0490 4.9189 4.4824 2.4691 4.4826 3.0426 7.0447 1.1767 5.9688 3.7277 7.2361 6.0603 1.4133 4.8281 1.2263 1.4361 8.7563 1.3830 6.7319 6.2551 1.7585 3.0113 1.3087 2.3594 1.6513 5.9031 1.5310 1.3187 1.1628 1.1382 1.1002 3.1318 1.4903 1.8639 1.4335 1.4475 3.4218 5.1466 1.3174 4.8314 3.4509 1.1715 1.1441 1.0471 1.1207 1.9846 3.0529 5.5706 5.3243 5.9635 1.0384 1.0569 1.0602 1.1091 1.0984 1.1073 1.0894 1.0978 1.0939 1.0900 1.0958 1.0764
irintensity: 0.0002 0.9168 0.7881 10.9084 0.7686 0.2406 0.0759 16.3398 0.0109 0.8589 0.1330 1.2331 9.9007 0.0330 0.6122 6.5965 28.0611 4.4166 0.2290 3.9976 62.8187 5.5494 0.3396 2.5148 73.3817 52.6016 0.7382 0.3303 62.6482 140.9869 0.7970 17.8463 37.1714 38.9023 2.8760 0.9206 40.6752 7.9005 138.6669 0.5672 36.5956 2.7168 0.6098 0.0365 61.8405 66.8791 63.9249 25.3598 52.8925 191.6485 41.8212 80.2798 74.4459 62.3341 32.4138 43.9336 19.7666 46.6913 104.4063 479.7663 63.6187 138.5636 26.8211 10.9818 26.3396 32.4721 15.9393 16.6759 19.2921 25.6516 7.4643 14.4159 0.2390 5.6993 11.1166
temp: 298.150 k
press: 1.00000 atm
elementType: 8 7 7 7 7 6 6 6 6 6 6 6 6 6 6 1 1 1 1 1 1 1 1 1 1 1 1
symmnumber: 1
zpe: 555289.6 jmol-1
zpe.correction: 0.211499 hartree
zpe.thermalcorrener: 0.224582 hartree
zpe.thermalcorrenthalpy: 0.225527 hartree
zpe.thermalcorrgfe: 0.170593 hartree
zpe.sumelectzpe: -681.365577 hartree
zpe.sumelectthermal: -681.352493 hartree
zpe.sumelectthermalent: -681.351549 hartree
zpe.sumelectthermalfe: -681.406483 hartree
dipole: 0.4121 7.6284 0.0185
dipole: 7.6396
quadrupole: -76.3752 -89.5965 -89.8745
quadrupole: -0.9926 -0.0977 -0.0476
quadrupole: 8.9069 -4.3144 -4.5925 -0.9926 -0.0977 -0.0476
hfenergy: -681.5770759 hartree
pointgroup: C01 [X(C10H12N4O1)]
dipole: -0.1709158 -3.0006116 -0.0317527 debye
polarizability: 277.3868871|4.3286098|134.9125172|2.6549801|0.9017113|68.3089375 unknown
InChI: InChI=1S/C10H12N4O/c1-8(15)12-9-2-4-10(5-3-9)14-7-6-11-13-14/h2-5,12H,6-7H2,1H3
charge 0 multiplicity 1
27 atoms
O  -3.950458 1.554396 -0.011922
N  2.537545 -0.010303 0.048565
N  3.154761 1.256317 0.064259
N  4.446836 1.166721 0.080974
N  -3.111893 -0.640119 -0.031698
C  3.532157 -1.11749 0.052084
C  1.13271 -0.143157 0.028566
C  4.860721 -0.309469 0.076609
C  0.540403 -1.43379 0.002359
C  0.289161 1.001983 0.034823
C  -1.702676 -0.425993 -0.011167
C  -0.860541 -1.567337 -0.017191
C  -1.108932 0.867447 0.015142
C  -4.143174 0.303493 -0.031553
C  -5.541649 -0.317978 -0.055727
H  3.423892 -1.741107 -0.854128
H  3.398947 -1.756896 0.94371
H  5.467693 -0.490895 0.979237
H  5.493316 -0.478894 -0.810513
H  1.162325 -2.334575 -0.003315
H  0.744013 1.995434 0.05493
H  -1.298869 -2.573761 -0.037493
H  -1.753046 1.74832 0.020126
H  -3.402968 -1.620786 -0.048345
H  -5.6924 -0.937993 -0.959166
H  -6.283522 0.493222 -0.057521
H  -5.715353 -0.954692 0.831858
