program: Gaussian 09
title: 000288295
version: EM64L-G09RevD.01
frameworkgroup: C1[X(C13H14N4O2)]
method: RPBEPBE
basis: SDD
operation: Freq
keyword: #p
keyword: freq=noraman
keyword: PBEPBE/SDD
title: #p freq=noraman PBEPBE/SDD
converged: NO YES NO NO
title: Mulliken charges:
elementType: O O N N N N C C C C C C C C C C C C C H H H H H H H H H H H H H H
charge: -0.221250 -0.224463 -0.275624 -0.061866 0.002625 0.017642 -0.168683 -0.134809 -0.165451 -0.324225 -0.529986 -0.454498 -0.462123 0.418428 -0.343060 -0.320725 -0.352974 -0.384582 0.394732 0.270226 0.268741 0.271465 0.267270 0.258257 0.239352 0.238837 0.208064 0.213820 0.239616 0.290098 0.251992 0.287683 0.285470
chargesum: 0.00000
title: Mulliken charges with hydrogens summed into heavy atoms:
elementType: O O N N N N C C C C C C C C C C C C C
charge: -0.221250 -0.224463 -0.275624 -0.061866 0.002625 0.017642 0.101543 0.133932 0.106013 -0.056955 -0.032377 -0.007597 -0.008686 0.418428 -0.052963 -0.068732 -0.065291 -0.099112 0.394732
polarizability: 3.23311759e+02 -1.74641863e+01 1.65555741e+02 1.21208097e+01 1.00517778e+01 9.96134266e+01
1716.lowfreq: -13.8805 -1.9228 0.0007 0.0007 0.0009 3.2734 34.2036 50.6712 77.7089
frequency: 33.8992 50.6409 77.7002 84.7009 103.3352 154.1963 206.7100 220.4906 237.9788 271.8948 291.4400 340.3522 360.1235 420.6054 447.1540 462.4392 478.0627 500.5046 517.9339 547.4050 587.8189 623.7287 666.3311 680.9443 733.9150 739.4751 754.5404 788.0895 797.2488 824.5778 834.1506 845.7535 859.7329 862.2687 868.6298 871.6678 886.5603 925.3617 938.5140 959.5414 966.1482 973.4251 980.3633 996.9911 1001.6704 1008.3274 1039.2396 1050.7351 1051.5286 1098.6639 1106.8199 1114.5427 1127.1327 1155.2243 1180.6305 1190.8831 1197.7760 1211.7939 1227.4021 1243.5264 1252.7297 1266.1355 1275.6247 1286.8220 1297.1271 1300.2920 1306.5440 1320.4773 1350.4841 1365.2873 1391.2046 1421.0398 1445.7334 1472.2054 1478.1966 1495.3937 1498.8842 1581.8858 1614.6308 3003.7162 3017.6995 3023.0556 3029.3739 3057.9531 3059.5354 3080.3540 3082.5572 3097.7080 3098.3809 3161.7760 3176.0120 3184.9784 3195.4052
redmass: 5.4821 7.3666 4.4695 5.2468 5.2242 5.6046 8.0828 5.0057 3.5821 2.8122 5.0806 6.4084 4.0871 3.0380 2.4859 6.5480 4.7599 3.3745 6.2395 4.7875 5.2580 7.1505 4.9184 7.8854 4.8230 5.6128 2.6876 7.7233 1.9806 1.5393 3.0436 3.9627 3.6281 1.5548 2.5321 3.2144 2.9278 3.0662 2.7019 2.2483 1.6650 3.7994 1.3482 2.7996 1.3307 1.5825 1.7699 2.0531 2.1721 3.0014 1.0966 1.2142 1.1942 2.2112 1.4593 1.5970 1.9798 1.2435 3.9931 1.3477 1.4712 1.3099 1.4194 1.5077 1.4384 1.3937 1.5102 1.4820 7.8498 3.6251 7.3051 8.7659 4.2962 1.0790 1.0890 1.1217 3.0899 8.1654 6.3884 1.0596 1.0628 1.0864 1.0605 1.1016 1.0903 1.0939 1.0993 1.1042 1.0938 1.0886 1.0892 1.0960 1.0968
irintensity: 0.2777 1.2303 1.7261 1.2906 2.3142 1.1341 0.7681 5.1313 1.2571 0.4166 0.3869 0.2631 0.6050 0.1271 2.2417 0.6362 2.1129 9.9510 5.1272 0.7604 3.0808 3.3000 21.4591 16.7813 4.1942 11.9755 6.2640 18.9637 6.7907 16.2978 38.6318 128.4918 137.5439 62.6178 1.9902 20.4632 7.5099 5.9442 132.8435 12.1976 5.2997 1.5627 5.3209 1.7321 0.1663 1.0959 39.1396 22.7076 22.3811 14.0984 0.2069 18.2363 20.9757 2.2211 217.9380 0.3527 3.4425 3.9749 611.1501 10.9379 4.5096 2.6632 0.6548 4.0382 8.9121 0.7348 1.1228 9.3656 101.9503 157.3560 32.4252 57.0229 17.1907 2.7238 18.6389 21.8598 101.6399 6.7405 375.1124 26.8346 60.6576 18.2183 17.2401 3.0672 15.6451 27.9385 49.4490 21.3102 31.1368 7.8085 0.4984 3.5763 1.3986
temp: 298.150 k
press: 1.00000 atm
elementType: 8 8 7 7 7 7 6 6 6 6 6 6 6 6 6 6 6 6 6 1 1 1 1 1 1 1 1 1 1 1 1 1 1
symmnumber: 1
zpe: 678692.0 jmol-1
zpe.correction: 0.258500 hartree
zpe.thermalcorrener: 0.273170 hartree
zpe.thermalcorrenthalpy: 0.274114 hartree
zpe.thermalcorrgfe: 0.215818 hartree
zpe.sumelectzpe: -871.736011 hartree
zpe.sumelectthermal: -871.721341 hartree
zpe.sumelectthermalent: -871.720397 hartree
zpe.sumelectthermalfe: -871.778693 hartree
dipole: -8.3802 -2.5800 -0.7031
dipole: 8.7965
quadrupole: -141.3991 -116.1695 -107.8536
quadrupole: 14.4599 -0.6929 1.0771
quadrupole: -19.5917 5.6379 13.9538 14.4599 -0.6929 1.0771
hfenergy: -871.994511 hartree
pointgroup: C01 [X(C13H14N4O2)]
dipole: 3.2625539 1.0891089 -0.3829523 debye
polarizability: 322.5212777|-14.2481152|165.4509784|-21.7250251|-7.809204|100.5086711 unknown
InChI: InChI=1S/C13H14N4O2/c18-17(19)11-5-3-10(4-6-11)16-13-9-2-1-8(7-9)12(13)14-15-16/h3-6,8-9,12-13H,1-2,7H2
charge 0 multiplicity 1
33 atoms
O  -5.534887 -0.643995 0.541317
O  -5.179837 1.554913 0.033969
N  0.788157 -0.69867 -0.444733
N  2.557103 -2.079935 -0.596305
N  1.29434 -2.033428 -0.330763
N  -4.760615 0.342199 0.21647
C  2.288972 1.242778 0.335492
C  4.08461 -0.165024 0.136938
C  1.853612 0.271877 -0.80971
C  3.090696 -0.696771 -0.937741
C  3.113101 0.299253 1.258782
C  3.399529 2.160365 -0.263038
C  4.638994 1.194243 -0.387441
C  -0.578126 -0.447121 -0.277592
C  -1.470559 -1.503855 0.079908
C  -1.09031 0.870301 -0.472127
C  -2.83661 -1.243838 0.241575
C  -2.460159 1.128007 -0.313789
C  -3.326175 0.070865 0.045322
H  1.455099 1.785221 0.807125
H  4.85052 -0.904333 0.413642
H  1.586021 0.800869 -1.741534
H  3.546374 -0.759463 -1.939869
H  2.520764 -0.517775 1.704188
H  3.629277 0.845243 2.066333
H  3.612406 3.000096 0.421023
H  3.102391 2.596008 -1.23455
H  5.019737 1.120036 -1.421714
H  5.474895 1.535166 0.248101
H  -1.071359 -2.510345 0.220183
H  -0.420185 1.687419 -0.752516
H  -3.53666 -2.037264 0.515864
H  -2.873214 2.129159 -0.46171
