program: Gaussian 09
title: 000288233
version: EM64L-G09RevD.01
frameworkgroup: C1[X(C8H14O)]
method: RPBEPBE
basis: SDD
operation: Freq
keyword: #pfreq=noraman
keyword: PBEPBE/SDD
title: #p freq=noraman PBEPBE/SDD
converged: NO YES NO NO
title: Mulliken charges:
elementType: O C C C C C C C C H H H H H H H H H H H H H H
charge: -0.435077 0.438318 -0.552495 -0.567672 -0.219219 -0.526928 -0.423725 -0.398705 -0.412453 0.240907 0.222885 0.228730 0.228046 0.218064 0.207094 0.197231 0.222746 0.201121 0.203544 0.203370 0.186091 0.216505 0.321621
chargesum: 0.00000
title: Mulliken charges with hydrogens summed into heavy atoms:
elementType: O C C C C C C C C
charge: -0.113456 0.438318 -0.088704 -0.110895 -0.001155 -0.122603 0.000142 0.008209 -0.009856
polarizability: 9.15990561e+01 4.91291819e-01 8.04839181e+01 1.24446655e+00 -5.45060966e-03 7.85620904e+01
1716.lowfreq: -16.4363 -0.0008 0.0000 0.0003 17.6041 21.6809 107.3184 152.7706 210.3384
frequency: 107.2994 152.7571 210.3335 235.6539 257.4437 284.8153 348.8831 380.4402 397.6286 454.9302 540.0484 586.9592 695.4939 770.8727 795.5889 817.0873 846.1586 868.6004 896.5187 911.2600 924.1178 956.6032 968.0038 991.6300 1032.8693 1046.4734 1061.3186 1085.3561 1099.6654 1127.2765 1140.5846 1155.9801 1208.8106 1216.4717 1251.2259 1282.7763 1296.9195 1326.6976 1335.0401 1337.6264 1344.0057 1360.9212 1391.1351 1442.0954 1449.2400 1462.5056 1467.7305 1472.2244 1480.1108 2941.0526 2955.7481 2973.8531 2980.7993 3021.1385 3031.0587 3038.0378 3040.6787 3051.7528 3078.4650 3091.6512 3173.8798 3194.4839 3548.2812
redmass: 3.2093 2.7473 2.0051 1.2348 2.7677 2.2178 1.8440 2.9276 2.7750 2.2973 2.9207 2.7477 2.4738 1.0736 1.6226 2.7451 2.1679 1.9184 1.9174 1.9084 1.9832 2.2750 1.6496 2.4255 1.2557 1.7964 1.4061 1.8112 1.4612 1.5392 1.2799 1.4415 1.4616 1.5669 1.3468 1.3129 1.4487 2.1650 1.4804 1.4870 1.6772 1.2774 1.6284 1.0901 1.0871 1.1141 1.1309 1.2520 1.0880 1.0667 1.0669 1.0610 1.0624 1.0937 1.0926 1.0969 1.0941 1.1007 1.0528 1.0612 1.1163 1.1145 1.0657
irintensity: 1.8033 0.5504 13.8546 107.8856 9.5340 0.9170 0.1559 6.0903 0.2120 3.8939 6.1058 1.6170 11.0745 2.2010 3.4672 5.2068 13.3793 10.3382 14.8559 2.5808 12.6844 51.5164 11.1427 2.4695 23.8009 10.9908 10.0149 24.6926 2.2735 13.6122 7.1952 7.0200 13.0405 3.3414 4.3193 2.3913 3.8327 2.8014 0.5186 0.8757 5.2714 10.4772 17.1714 11.6539 9.9677 10.6606 6.6202 10.9398 10.4616 39.6517 36.6425 30.4676 24.2758 48.3316 72.7939 7.5129 67.0505 48.3631 24.5358 15.8961 2.7396 25.6529 2.8906
temp: 298.150 k
press: 1.00000 atm
elementType: 8 6 6 6 6 6 6 6 6 1 1 1 1 1 1 1 1 1 1 1 1 1 1
symmnumber: 1
zpe: 534701.3 jmol-1
zpe.correction: 0.203657 hartree
zpe.thermalcorrener: 0.212569 hartree
zpe.thermalcorrenthalpy: 0.213513 hartree
zpe.thermalcorrgfe: 0.170705 hartree
zpe.sumelectzpe: -387.710831 hartree
zpe.sumelectthermal: -387.701920 hartree
zpe.sumelectthermalent: -387.700975 hartree
zpe.sumelectthermalfe: -387.743784 hartree
dipole: -0.7227 -2.1423 0.2915
dipole: 2.2796
quadrupole: -55.8622 -61.6303 -53.6489
quadrupole: -0.3363 1.1728 2.7183
quadrupole: 1.1849 -4.5831 3.3982 -0.3363 1.1728 2.7183
hfenergy: -387.9144884 hartree
pointgroup: C01 [X(C8H14O1)]
dipole: 0.2802383 0.848154 0.0803358 debye
dipolederiv: -0.5595805 0.2020874 -0.0888236 0.2389666 -0.5198029 -0.2621911 -0.0871898 -0.3063366 -0.5702133 -0.1835038 0.1173943 0.079836 0.0922418 -0.0086077 -0.0029983 -0.0051004 0.0361625 0.0777675 -0.1459484 -0.0626255 -0.0605512 -0.0780912 0.0419478 -0.0545598 -0.1148243 -0.0432845 -0.0080661 0.0217026 -0.0024781 0.0205118 0.0411052 -0.0042768 -0.1229013 0.0552944 -0.1030572 -0.1252193 0.4414826 -0.1433452 0.0034297 -0.2198007 0.4664913 0.1851036 0.0594555 0.2157007 0.4757468 0.0432661 0.0135825 -0.0394079 0.0492546 0.0703984 0.0323513 -0.0434331 0.0411778 0.1523642 -0.0587665 -0.053797 -0.0714055 0.0230743 0.0220157 -0.0057725 -0.0296555 -0.033761 0.044586 0.052505 0.0049275 -0.0373906 -0.0072469 0.0726809 0.0103281 -0.0012862 0.0258039 0.1015039 0.0591889 -0.014366 -0.0124496 -0.0245181 0.0748613 0.0512462 -0.0384606 0.0506353 0.1120075 0.0435164 -0.0621497 -0.0274559 -0.1137799 -0.0680532 0.0089559 -0.0095741 0.0362409 0.071697 0.022024 0.0175338 -0.0743051 0.0559042 0.0168603 0.0895382 -0.1137541 0.0597164 -0.0251406 0.0999556 0.0254545 0.0099526 0.048847 -0.1255219 -0.0478321 0.0093098 -0.0040164 0.0452177 0.1051505 -0.0012968 0.0056431 -0.0136146 0.0261585 0.0849458 0.0357022 0.0405299 -0.1025964 -0.0352666 -0.0840203 0.0904412 -0.0669249 -0.0424886 0.051264 0.0657636 0.0438041 -0.0477339 -0.0560286 0.1236787 -0.0629098 0.0981016 -0.0862699 0.0669619 -0.0307776 0.023935 0.0586903 -0.0030906 -0.0029169 0.0833335 -0.0197969 0.0142068 -0.1300781 0.0690163 -0.0819229 -0.1529409 -0.0523378 0.0968115 -0.0430853 0.1032873 -0.1043509 0.08858 -0.0302516 0.0591164 0.0596003 0.0469277 -0.0126629 0.0647463 -0.0078915 0.0183737 -0.1231588 0.0478723 -0.0762683 -0.1189331 0.0355282 0.061851 0.0328248 0.0351496 0.0027235 -0.0772695 0.0066773 -0.1317645 -0.1038542 -0.0519769 -0.1002144 0.0669671 -0.0961025 -0.0722608 0.1031082 0.0744034 0.1354012 -0.0200006 0.0662806 0.0288691 0.0352996 0.0655354 -0.0278863 -0.0815603 0.1035176 -0.0884766 -0.1413146 -0.161514 -0.0498202 -0.0901431 -0.0739961 0.0313327 -0.0173907 -0.1256635 -0.0184941 0.0248214 0.2704858 -0.1024974 0.1149417 -0.1297041 0.2014682 0.153329 0.1029583 0.119158 0.1920104 unknown
polarizability: 91.5983394|0.491994|80.4854904|-1.2442506|-0.0787221|78.5612348 unknown
InChI: InChI=1S/C8H14O/c9-7-3-1-2-4-8(7)5-6-8/h7,9H,1-6H2
charge 0 multiplicity 1
23 atoms
O  0.243475 -2.081611 -0.742756
C  -0.817695 0.067606 -0.030645
C  -2.318175 -0.123304 -0.253422
C  -1.819417 0.620962 0.99856
C  0.008719 -1.153908 0.390725
C  -0.046173 1.063249 -0.905256
C  1.345053 -0.717981 1.041537
C  1.275383 1.500849 -0.225921
C  2.136541 0.269534 0.147634
H  -2.729758 -1.129584 -0.127807
H  -2.802654 0.463226 -1.041216
H  -1.963964 1.705691 1.045991
H  -1.9095 0.117083 1.967334
H  -0.56983 -1.776546 1.096849
H  -0.680809 1.94449 -1.12069
H  0.182824 0.601428 -1.891004
H  1.946896 -1.620234 1.256861
H  1.118584 -0.226108 2.009173
H  1.038699 2.069909 0.695968
H  1.841899 2.179021 -0.892806
H  2.469881 -0.243946 -0.780103
H  3.059046 0.587036 0.669446
H  0.732374 -1.590763 -1.451952
