program: Gaussian 09
title: 000027632
version: EM64L-G09RevD.01
frameworkgroup: C1[X(C12H12BrN5O)]
method: RPBEPBE
basis: SDD
operation: Freq
keyword: #p
keyword: freq=noraman
keyword: PBEPBE/SDD
title: #p freq=noraman PBEPBE/SDD
converged: YES YES NO NO
title: Mulliken charges:
elementType: Br O N N N N N C C C C C C C C C C C C H H H H H H H H H H H H
charge: 0.004607 -0.246484 -0.394596 -0.458244 -0.217748 -0.245803 -0.671981 0.412903 0.450021 0.159555 0.278097 -0.436368 -0.437842 -0.299939 -0.793498 -0.156262 -0.165985 0.055552 -0.238470 0.328990 0.300503 0.252353 0.224188 0.308783 0.255972 0.241323 0.241577 0.250810 0.244507 0.296476 0.457002
chargesum: 0.00000
title: Mulliken charges with hydrogens summed into heavy atoms:
elementType: Br O N N N N N C C C C C C C C C C C C
charge: 0.004607 -0.246484 -0.065605 -0.157741 -0.217748 -0.245803 0.081497 0.412903 0.450021 0.159555 0.278097 -0.184015 -0.213653 0.008844 -0.054626 0.094547 0.078522 0.055552 -0.238470
polarizability: 3.46274115e+02 1.18487050e+01 2.09892642e+02 2.40536317e-01 -2.90091694e-01 7.44872001e+01
1716.lowfreq: -1.3733 -0.8849 -0.0004 -0.0002 0.0003 1.8968 21.1116 27.8799 47.6477
frequency: 20.8867 27.8600 47.6459 74.1131 87.8085 118.5853 136.2623 141.5289 159.5393 174.1335 206.7652 253.2531 264.0680 270.6168 305.6021 310.5935 368.9344 409.4364 416.4267 421.7247 500.7718 508.9386 513.6924 553.2822 557.5669 581.7157 604.8355 625.8558 628.8740 651.1406 683.7510 704.2803 712.4461 743.6988 753.4319 812.7519 820.9706 845.6486 850.9453 910.7347 935.7594 940.3293 977.8163 984.6324 990.2631 1029.8375 1045.6847 1052.3702 1060.9835 1076.5965 1110.7619 1122.8437 1161.5535 1183.5055 1218.9914 1259.1296 1288.5327 1301.7052 1330.6341 1372.2919 1400.1012 1400.9281 1410.7562 1424.8965 1462.4904 1467.5902 1468.4516 1474.9909 1529.1852 1544.2176 1579.0464 1603.6333 1605.1303 1644.8301 1662.7962 2733.4089 2979.7028 3055.6632 3115.0124 3116.8754 3162.6475 3171.8734 3190.4620 3196.1299 3536.1890 3552.6873 3583.9944
redmass: 4.4946 6.3061 7.7129 7.1428 4.3383 1.2465 7.8305 5.1653 3.1331 9.8336 3.5200 7.8850 7.9318 3.6863 4.1984 4.0067 4.4726 2.7287 1.4207 5.8263 5.4948 2.6001 6.6510 4.1241 5.1516 7.3678 1.2408 7.1464 1.2766 6.0897 5.0319 3.5347 3.9179 5.5700 6.9788 1.4073 5.5265 1.4003 1.5270 5.6025 6.6757 1.3579 1.9312 1.3188 4.9831 3.1229 1.0802 1.5265 2.4463 2.8133 1.4949 1.4749 3.5361 1.1116 1.9505 1.8780 1.6630 1.7481 2.6633 4.6949 3.5230 1.9753 2.2703 3.4459 1.7430 1.0434 1.3495 2.1368 2.7744 4.0123 7.7904 3.9135 4.5194 3.9649 3.0344 1.0834 1.0391 1.0979 1.0903 1.0969 1.0910 1.0949 1.0936 1.0946 1.0756 1.0779 1.0821
irintensity: 3.2316 1.1587 2.1118 1.2916 11.1150 0.2190 12.8737 0.1279 0.3332 0.3084 3.3638 13.3598 7.6993 4.5990 6.3210 0.1037 0.3082 1.5721 14.3273 11.5755 4.0453 64.5350 0.5122 1.4341 7.1199 0.4370 99.5043 0.4454 134.8593 4.4031 0.6429 0.1330 24.7540 2.1186 15.9182 42.9202 8.0033 52.3929 37.8199 12.8724 2.2425 1.0412 1.1653 2.4126 43.5128 9.1804 127.1230 8.0804 26.7289 11.7695 1.4579 19.3943 35.6495 4.1875 144.0244 151.4304 2.2563 84.3542 34.7849 133.0132 51.4753 92.7020 20.6136 303.6983 719.6210 17.9803 6.4512 421.3225 1015.5631 577.6317 60.0563 138.1532 4.8121 194.5349 695.3511 723.0139 20.9107 15.1627 16.4893 11.5191 3.8214 3.9558 2.4781 23.8341 22.5918 43.7932 38.0343
temp: 298.150 k
press: 1.00000 atm
elementType: 35 8 7 7 7 7 7 6 6 6 6 6 6 6 6 6 6 6 6 1 1 1 1 1 1 1 1 1 1 1 1
symmnumber: 1
zpe: 605902.7 jmol-1
zpe.correction: 0.230776 hartree
zpe.thermalcorrener: 0.248255 hartree
zpe.thermalcorrenthalpy: 0.249199 hartree
zpe.thermalcorrgfe: 0.182745 hartree
zpe.sumelectzpe: -825.599676 hartree
zpe.sumelectthermal: -825.582197 hartree
zpe.sumelectthermalent: -825.581253 hartree
zpe.sumelectthermalfe: -825.647707 hartree
dipole: 3.3185 1.0605 0.0201
dipole: 3.4839
quadrupole: -170.4203 -88.1093 -125.8403
quadrupole: -30.9270 -0.0198 -0.0931
quadrupole: -42.2970 40.0140 2.2830 -30.9270 -0.0198 -0.0931
hfenergy: -825.8304522 hartree
pointgroup: C01 [X(C12H12Br1N5O1)]
dipole: -1.2036517 -0.6534792 0.0542199 debye
polarizability: 337.0186711|36.3487646|217.9856684|-0.438655|-12.7484003|75.6496178 unknown
InChI: InChI=1S/C12H12BrN5O/c1-7-6-10(19)17-12(15-7)18-11(14)16-9-4-2-8(13)3-5-9/h2-6,15-16H,14H2,1H3
charge 0 multiplicity 1
31 atoms
Br -6.118737 -2.276811 0.502688
O  5.050012 2.000629 0.237638
N  2.381425 -1.077399 0.497012
N  -1.379594 1.720821 0.184638
N  0.57181 0.367445 0.334295
N  2.824886 1.261051 0.279209
N  0.740262 2.740459 0.115925
C  3.741529 -1.398908 0.546195
C  -2.414381 0.750158 0.262781
C  1.947477 0.245084 0.364401
C  0.007924 1.589074 0.213836
C  4.659909 -0.375043 0.460104
C  -3.751065 1.235656 0.215553
C  -2.189612 -0.646612 0.381093
C  4.080495 -2.861743 0.692318
C  -4.845537 0.351432 0.285212
C  -3.285388 -1.532837 0.451278
C  4.236729 1.031804 0.319563
C  -4.601407 -1.032364 0.403383
H  1.656004 -1.79425 0.556705
H  -1.714372 2.682233 0.094363
H  5.731485 -0.582217 0.494508
H  -3.944136 2.31233 0.123826
H  -1.161555 -1.007313 0.415558
H  5.17192 -3.000571 0.717814
H  3.679414 -3.453682 -0.152362
H  3.660312 -3.280213 1.626761
H  -5.867856 0.737762 0.24822
H  -3.106778 -2.608251 0.542502
H  0.320054 3.664437 0.024137
H  1.795971 2.553141 0.145946
