program: Gaussian 09
title: 000288237
version: EM64L-G09RevD.01
frameworkgroup: C1[X(C11H10O4)]
method: RPBEPBE
basis: SDD
operation: Freq
keyword: #pfreq=noraman
keyword: PBEPBE/SDD
title: #p freq=noraman PBEPBE/SDD
converged: YES YES NO NO
title: Mulliken charges:
elementType: O O O O C C C C C C C C C C C H H H H H H H H H H
charge: -0.427956 -0.432216 -0.205362 -0.211632 -0.268359 -0.275671 -0.214043 -0.245494 -0.361096 -0.362301 -0.468659 0.279911 0.238586 0.024799 0.030092 0.281032 0.271953 0.262687 0.291084 0.283765 0.297394 0.221574 0.221929 0.383458 0.384526
chargesum: 0.00000
title: Mulliken charges with hydrogens summed into heavy atoms:
elementType: O O O O C C C C C C C C C C C
charge: -0.044498 -0.047691 -0.205362 -0.211632 0.012673 -0.003718 0.048645 0.045590 -0.077332 -0.064907 -0.025156 0.279911 0.238586 0.024799 0.030092
polarizability: 1.45867130e+02 4.74116842e-01 1.32852868e+02 -8.86015898e-01 -2.60607566e+00 8.59567538e+01
1716.lowfreq: -1.7178 0.0002 0.0007 0.0009 11.1025 15.0473 28.2108 55.1978 95.4174
frequency: 28.1942 55.1859 95.3384 106.7381 138.7576 167.6817 317.8554 331.3690 344.0517 361.9366 409.5298 438.9337 500.4171 566.8152 589.2314 606.6351 627.1362 642.1975 687.8571 706.4494 723.2970 747.0727 776.1921 798.5865 806.5463 821.0927 876.4673 891.3711 894.1812 926.9579 935.5424 951.1732 973.1947 990.4184 1008.2928 1013.6297 1024.3312 1058.5874 1060.7691 1080.8280 1109.7108 1128.6032 1147.0606 1175.5855 1183.7564 1211.0059 1220.8824 1249.7903 1253.7195 1258.7803 1259.9266 1286.1680 1307.0548 1327.7055 1332.9591 1465.3104 1605.6048 1634.8207 1665.9421 3005.2095 3065.4535 3098.0023 3108.0379 3119.3740 3166.1045 3180.2525 3199.8557 3515.8320 3521.4676
redmass: 10.0667 11.0545 4.2217 5.1919 9.6764 4.8611 8.7266 6.2741 3.6600 7.2963 3.1367 2.7095 3.1264 3.1165 2.0702 1.7112 1.9111 5.0481 5.1513 5.6051 7.1762 4.0347 2.4121 1.7484 3.9205 5.8196 2.2242 2.6363 2.3408 3.7997 5.1594 2.4519 1.7204 1.2570 2.5813 2.3976 1.7958 1.1875 1.2917 2.1086 1.4939 1.9765 1.7797 1.7494 1.7641 1.6796 1.3250 1.7004 2.2573 1.6195 1.5000 2.4066 1.8564 3.9812 2.5891 1.0985 9.6094 8.9686 9.4290 1.0596 1.1045 1.0898 1.0896 1.0920 1.0922 1.0920 1.1012 1.0640 1.0641
irintensity: 1.7772 0.3884 0.0203 0.9809 0.2902 0.2430 6.3625 0.3404 1.3158 3.8622 5.7129 3.4072 9.2437 88.7930 105.1381 129.3008 15.6177 11.1691 12.5093 23.0693 24.2654 1.6666 33.2651 15.9898 1.1260 0.4931 3.7890 1.5016 4.9635 34.8153 160.1020 12.2326 0.3887 6.5456 9.2398 5.5814 49.4108 2.4344 5.7396 487.4664 12.0927 3.9697 0.6366 8.7336 3.4123 7.7235 0.2650 4.3986 12.3793 35.2703 1.6888 0.5138 0.3896 119.5811 5.6645 9.2271 3.7997 83.4699 390.7944 41.4985 20.4478 12.0558 22.8363 10.2815 11.0144 6.0541 13.3771 39.8707 40.3822
temp: 298.150 k
press: 1.00000 atm
elementType: 8 8 8 8 6 6 6 6 6 6 6 6 6 6 6 1 1 1 1 1 1 1 1 1 1
symmnumber: 1
zpe: 495761.3 jmol-1
zpe.correction: 0.188826 hartree
zpe.thermalcorrener: 0.200749 hartree
zpe.thermalcorrenthalpy: 0.201693 hartree
zpe.thermalcorrgfe: 0.149479 hartree
zpe.sumelectzpe: -724.941790 hartree
zpe.sumelectthermal: -724.929867 hartree
zpe.sumelectthermalent: -724.928922 hartree
zpe.sumelectthermalfe: -724.981136 hartree
dipole: 3.9875 0.0088 0.1957
dipole: 3.9923
quadrupole: -92.5268 -73.0312 -84.4973
quadrupole: -0.5590 -1.3440 -0.4873
quadrupole: -9.1751 10.3206 -1.1455 -0.5590 -1.3440 -0.4873
hfenergy: -725.1306152 hartree
pointgroup: C01 [X(C11H10O4)]
dipole: -1.5698953 0.0375836 -0.0331609 debye
dipolederiv: -0.2957485 -0.1362263 -0.0523752 -0.1065056 -1.1719689 -0.2947207 -0.0139535 -0.3737594 -0.5445145 -0.3002723 0.050241 -0.0347579 0.0368754 -1.3289238 -0.2038764 -0.0570998 -0.1892974 -0.4315793 -0.9415501 0.1052675 -0.2650572 0.1792702 -0.5797724 -0.0555786 -0.2070441 -0.1363534 -0.4055669 -0.905893 -0.0733031 0.2650049 -0.1209351 -0.5963085 -0.0325473 0.2765187 -0.0693082 -0.4186742 -0.1216003 -0.0155458 -0.0029325 0.0101098 -0.1396991 -0.0165272 0.1379587 0.0845771 0.0414475 -0.0644273 -0.0237486 0.0050188 0.0121333 -0.1711933 0.043997 0.1426673 -0.0727489 0.0493521 -0.0332847 -0.0072075 0.0729308 -0.0386401 0.0498384 -0.0065385 -0.138925 -0.010433 0.0260033 0.1134169 0.0298488 0.0009925 -0.0104942 -0.1145175 0.0136145 -0.0719357 0.0107802 0.1125268 -0.0651033 -0.0265191 0.023796 0.1118851 0.1312981 -0.0855208 -0.0504782 -0.2298506 0.0442875 -0.1460031 0.0282759 0.0227419 -0.0719604 0.1007246 0.0788961 -0.0773545 0.1118638 0.0046183 -0.1145601 -0.0033563 -0.0496848 0.0120607 0.2079456 -0.0067688 -0.01251 -0.0161524 0.0312584 0.0042262 0.3348027 -0.0766896 0.5988432 -0.2278684 -0.029848 0.0235927 0.1200903 -0.0747183 0.0445808 -0.3462387 0.0682704 -0.630259 -0.3066267 -0.0106383 0.0949306 0.0475235 -0.0703838 1.1977647 -0.3266075 0.4006823 -0.2768554 1.6203372 0.3846287 0.2920841 0.4850195 0.5272748 1.1316398 0.3699766 -0.3923176 0.2672688 1.7725735 0.2075092 -0.3452762 0.120961 0.4479817 0.073248 0.0472461 0.0026726 0.0319186 0.0373782 -0.0663708 -0.021006 -0.080781 -0.0288851 0.0710772 -0.0531827 0.0096161 -0.0367322 0.0469122 0.0634791 -0.0161641 0.0782842 -0.0560028 -0.092856 -0.0049581 -0.0773811 0.0016462 0.157381 -0.0081474 -0.0837275 -0.0048508 -0.0156695 0.0517063 -0.0027371 -0.077982 -0.0003618 0.0723913 -0.0074905 -0.0424375 -0.0086609 -0.1120367 0.0473964 -0.0175027 0.005317 -0.0189301 -0.0729409 0.0687298 -0.0007511 0.0814207 0.0426615 0.0704296 0.0315293 -0.0011883 0.0140383 -0.0535798 -0.0406102 0.0141816 -0.0649368 0.0681987 0.0071445 -0.0497334 0.0528277 -0.1340122 -0.0520143 0.0994794 0.0666416 0.0648048 0.0191701 0.0115411 0.0551854 0.0438182 0.1362649 -0.0717312 -0.09035 0.0535376 -0.0547557 0.0376496 0.1181005 0.0942068 -0.0331186 0.0353045 0.3297203 -0.0085716 -0.0755642 0.0534398 0.3641528 0.1390266 -0.0597133 0.0897955 -0.0019327 0.3606446 0.003771 0.1121145 0.0531235 0.3414482 unknown
polarizability: 145.7451322|-0.7242902|132.9493889|-2.5092697|1.9366115|85.9822306 unknown
InChI: InChI=1S/C11H10O4/c12-10(13)8-6-3-1-2-4(6)5(2)7(3)9(8)11(14)15/h2-7,12,14H,1H2
charge 0 multiplicity 1
25 atoms
O  1.256024 -2.832965 -0.44417
O  1.392434 2.912792 0.156007
O  2.821906 -1.482683 0.626632
O  2.762543 1.255813 -0.731935
C  -1.664243 -0.803847 -0.933276
C  -1.650636 0.733101 -1.014202
C  -2.946347 -0.002805 -0.598044
C  -1.533187 0.080545 1.230759
C  -0.922279 -1.117447 0.408576
C  -0.897318 1.172567 0.289851
C  -3.042679 0.078955 0.928427
C  0.533543 -0.682958 0.246132
C  0.545818 0.694335 0.164008
C  1.665713 -1.630148 0.174329
C  1.681627 1.572476 -0.18584
H  -1.560513 -1.451013 -1.804229
H  -1.542582 1.279604 -1.951853
H  -3.828037 -0.029449 -1.241721
H  -1.219632 0.132807 2.28339
H  -1.076048 -2.133303 0.796462
H  -1.021548 2.226865 0.568154
H  -3.560702 -0.791967 1.369918
H  -3.54298 1.001602 1.275163
H  2.032486 -3.455946 -0.467672
H  2.174637 3.47527 -0.094169
