program: Gaussian 09
title: 000288225
version: EM64L-G09RevD.01
frameworkgroup: C1[X(C9H14O3)]
method: RPBEPBE
basis: SDD
operation: Freq
keyword: #pfreq=noraman
keyword: PBEPBE/SDD
title: #p freq=noraman PBEPBE/SDD
converged: YES YES NO NO
title: Mulliken charges:
elementType: O O O C C C C C C C C C H H H H H H H H H H H H H H
charge: -0.183038 -0.251797 -0.241273 -0.441618 -0.282099 -0.387019 -0.393832 -0.403278 -0.486789 0.173698 0.210490 -0.506284 0.231699 0.224520 0.286264 0.199837 0.211748 0.197727 0.206171 0.216736 0.224768 0.239029 0.230804 0.237927 0.241685 0.243922
chargesum: 0.00000
title: Mulliken charges with hydrogens summed into heavy atoms:
elementType: O O O C C C C C C C C C
charge: -0.183038 -0.251797 -0.241273 0.014601 0.004166 0.024566 0.010066 0.038226 -0.016956 0.173698 0.210490 0.217250
polarizability: 1.25215776e+02 1.34179257e-01 9.44264945e+01 -2.97530311e+00 -2.94285684e+00 8.98389666e+01
1716.lowfreq: 0.0006 0.0006 0.0009 7.6762 12.6027 22.3063 37.4351 51.4841 96.3894
frequency: 37.1038 51.3522 96.3824 106.1305 115.8048 192.4407 204.8879 215.5343 247.6244 287.7748 323.3179 346.2614 376.5983 449.5543 483.3255 518.3342 620.1579 659.6834 721.1696 743.2040 801.3156 826.7621 850.2707 868.4998 891.0060 940.2291 962.7537 976.1813 998.3364 1053.9814 1081.1063 1111.7176 1113.1597 1122.8084 1132.6519 1149.5381 1158.2126 1187.9316 1234.4036 1250.3423 1266.4821 1286.3922 1306.5924 1315.1151 1340.5225 1341.9784 1348.5550 1356.5663 1420.7788 1453.1277 1460.4339 1462.6458 1464.9291 1467.2295 1474.3473 1482.6629 1614.2468 1632.7851 2966.3063 2972.1210 2984.8216 2989.5445 3005.8111 3006.3238 3024.7440 3032.1609 3045.3012 3048.0482 3070.7219 3079.0998 3109.0777 3153.5058
redmass: 5.2406 4.5853 1.4353 2.7710 2.7488 2.8520 3.9335 2.7247 3.5674 3.5350 2.1681 4.0067 3.1531 3.9827 1.7783 2.7156 5.6819 4.0131 3.1210 3.5913 2.6632 1.9004 2.5012 2.3310 2.7508 2.2041 3.9979 1.7087 2.4115 2.1253 1.9163 1.8060 1.5328 2.6755 2.8356 1.4735 1.6726 1.1189 1.4519 1.2618 1.2480 1.3643 1.2614 1.4195 1.3578 1.4190 1.4096 1.4124 1.1853 1.0502 1.1072 1.0511 1.0850 1.0822 1.0875 1.0833 8.8189 8.7210 1.0611 1.0634 1.0622 1.0619 1.0599 1.0297 1.0969 1.0990 1.0993 1.1011 1.0890 1.1040 1.1047 1.1049
irintensity: 3.6918 3.8197 0.1744 0.8613 0.2940 1.5334 7.4794 3.8623 3.4832 13.7623 4.8102 3.7036 0.4933 4.7780 2.2620 6.6035 1.4288 6.0649 3.0513 1.4454 3.7428 15.6521 6.8067 6.6387 3.0391 20.8425 13.4431 4.4604 3.4513 16.3592 7.5399 107.0955 39.2835 3.8483 236.4933 28.5397 11.1275 7.3978 54.8513 4.2681 1.6591 56.6501 40.4076 9.6713 11.0229 1.3283 1.4425 0.2029 22.5973 16.3124 15.7121 10.3467 6.2007 8.2899 10.2974 24.9489 270.1830 31.0624 29.2179 22.7830 29.2562 15.7966 7.1157 33.7364 54.2521 50.7408 4.2058 55.9943 13.1289 14.2938 24.3592 14.5921
temp: 298.150 k
press: 1.00000 atm
elementType: 8 8 8 6 6 6 6 6 6 6 6 6 1 1 1 1 1 1 1 1 1 1 1 1 1 1
symmnumber: 1
zpe: 571162.0 jmol-1
zpe.correction: 0.217544 hartree
zpe.thermalcorrener: 0.229978 hartree
zpe.thermalcorrenthalpy: 0.230922 hartree
zpe.thermalcorrgfe: 0.178167 hartree
zpe.sumelectzpe: -576.078792 hartree
zpe.sumelectthermal: -576.066358 hartree
zpe.sumelectthermalent: -576.065414 hartree
zpe.sumelectthermalfe: -576.118169 hartree
dipole: -0.0510 -2.0879 0.5330
dipole: 2.1555
quadrupole: -57.1990 -76.6014 -77.1520
quadrupole: 1.4793 -1.4552 7.2340
quadrupole: 13.1184 -6.2839 -6.8345 1.4793 -1.4552 7.2340
hfenergy: -576.2963361 hartree
pointgroup: C01 [X(C9H14O3)]
dipole: 0.0008726 0.7254467 0.4391771 debye
dipolederiv: -0.3976701 0.079835 -0.0651104 0.1893723 -0.621494 -0.2601423 -0.0791718 -0.292125 -0.7124531 -1.4842674 -0.0917263 -0.145093 -0.1661833 -0.2715398 0.002673 -0.3329904 -0.0045005 -0.5070093 -0.7043912 -0.0382616 0.1099898 -0.0667812 -0.2984503 0.0651811 -0.1239303 -0.0587958 -0.8974643 0.0672902 0.0395608 0.0030724 0.0844494 0.1541775 -0.0341687 0.0854412 0.06203 0.0616747 -0.6404801 0.1967039 0.2363095 0.2247282 -0.2331542 -0.1014306 0.1734247 -0.1157168 -0.0825907 0.0797774 0.0236751 -0.0061619 -0.0226622 0.0597546 0.0290681 -0.0314675 -0.0003172 0.1100207 0.0490066 -0.0105042 -0.0136064 -0.0215599 0.0588445 0.0188153 0.0130363 0.0383012 0.139637 0.271376 0.0303485 0.039599 0.0924927 0.0941867 0.0514935 -0.089789 0.0140788 0.092379 -0.3472301 -0.0076824 -0.2434885 0.0529519 -0.0206575 0.0181422 -0.1567774 0.0072384 -0.1039294 0.6354843 -0.3798746 0.2063135 -0.7265518 0.8187663 0.3400041 0.3680532 0.3252801 0.7468175 1.8420328 0.0744074 -0.0096837 0.2516727 0.0961022 -0.0809487 0.3059209 0.0992536 1.1433374 0.6298723 0.0343354 -0.0210432 0.0620416 0.2864955 0.0025468 -0.1329278 -0.0041388 0.2268903 0.067555 -0.0130336 -0.0039448 -0.0202295 0.083689 0.0334074 -0.0130587 -0.022506 -0.100357 -0.0281936 0.0842963 -0.0401708 0.0745859 -0.1191828 0.0283126 -0.0424614 0.0493353 0.0753006 0.0612562 0.0023384 -0.0333189 0.005409 0.0313798 0.0122075 -0.0531199 0.0194096 -0.0310334 -0.0222939 -0.0700553 -0.0000121 -0.0808824 -0.1919951 0.0224179 -0.0168789 -0.0094002 0.081117 0.0288672 0.0185786 -0.0084788 0.0369862 0.0748275 -0.0873826 0.0089558 -0.0334378 -0.1452009 0.0756973 0.0413792 0.0611442 0.0207554 0.0051836 -0.0386532 -0.0060977 -0.0606669 -0.1640684 -0.2094303 -0.0658363 0.0251792 -0.0654112 0.0146095 0.0117049 0.0543895 0.0285771 0.0721355 -0.0893993 0.0582128 -0.1070643 0.0516154 -0.0161931 0.0631222 -0.1166112 0.0911801 -0.0125625 0.0302376 -0.0153845 0.0334013 -0.0046474 0.0220877 -0.0430873 0.1052529 -0.0796886 -0.0989024 0.0712342 0.006214 0.0579154 0.037806 0.0839399 -0.070562 0.0371323 -0.0458906 -0.0321505 0.059032 -0.0080549 -0.0028381 0.0042353 -0.1305696 0.0336316 -0.0298877 -0.0064745 0.0707122 -0.0514351 -0.0166504 -0.0696681 -0.0192172 0.119784 -0.0003259 -0.1209106 -0.0079153 -0.0008767 0.0047796 -0.0183946 0.0098276 0.0310582 -0.0351245 -0.093793 0.1169062 -0.0874603 0.0191528 0.0012923 0.0455733 -0.0130687 -0.0260339 -0.0654675 0.077766 0.0775672 0.0943502 0.0494238 unknown
polarizability: 125.3606922|0.9752635|92.4118439|1.5142421|3.8228933|91.7087013 unknown
InChI: InChI=1S/C9H14O3/c1-12-9(11)7-5-3-2-4-6-8(7)10/h7H,2-6H2,1H3
charge 0 multiplicity 1
26 atoms
O  0.371409 -1.422058 -1.680814
O  -2.728944 0.256178 -0.467592
O  -1.583011 0.308724 1.56079
C  0.494274 1.801123 0.006762
C  -0.350121 0.624326 -0.565849
C  1.973337 1.844528 -0.464001
C  2.938227 0.995548 0.405499
C  2.79328 -0.537036 0.266944
C  1.349781 -1.078144 0.51914
C  0.445552 -0.70839 -0.64759
C  -1.580622 0.391229 0.308763
C  -3.981514 -0.022164 0.280745
H  0.463885 1.763163 1.112177
H  -0.016209 2.737085 -0.290465
H  -0.69412 0.838023 -1.591496
H  2.316092 2.896552 -0.422788
H  2.050027 1.537402 -1.527517
H  2.790484 1.280976 1.467633
H  3.982311 1.266596 0.151177
H  3.472373 -1.02851 0.989815
H  3.115324 -0.860896 -0.742297
H  0.951578 -0.678285 1.469442
H  1.387915 -2.18055 0.579019
H  -4.759302 -0.084968 -0.492453
H  -4.189133 0.793733 0.993219
H  -3.890075 -0.972183 0.833136
