program: Gaussian 09
title: 000003667
version: EM64L-G09RevD.01
frameworkgroup: C1[X(C17H18Cl2O4)]
method: RPBEPBE
basis: SDD
operation: Freq
keyword: #p
keyword: freq=noraman
keyword: PBEPBE/SDD
title: #p freq=noraman PBEPBE/SDD
converged: YES YES NO NO
title: Mulliken charges:
elementType: Cl Cl O O O O C C C C C C C C C C C C C C C C C H H H H H H H H H H H H H H H H H H
charge: 0.048510 0.050679 -0.166321 -0.216880 -0.424370 -0.176783 -0.059855 0.233756 -0.490252 -0.514183 -0.686734 -0.433973 -0.431370 0.010135 -0.773113 0.389127 0.286361 -0.584070 -0.309413 0.513953 -0.412230 -0.337141 0.162035 0.239038 0.195914 0.244077 0.228454 0.205634 0.240748 0.244405 0.205521 0.223870 0.222682 0.204308 0.245488 0.227455 0.222925 0.266297 0.254936 0.255213 0.395166
chargesum: 0.00000
title: Mulliken charges with hydrogens summed into heavy atoms:
elementType: Cl Cl O O O O C C C C C C C C C C C C C C C C C
charge: 0.048510 0.050679 -0.166321 -0.216880 -0.029204 -0.176783 0.179183 0.233756 -0.050260 -0.080095 -0.201582 -0.004582 -0.004381 0.010135 -0.077244 0.389127 0.286361 -0.317773 -0.309413 0.513953 -0.412230 0.173009 0.162035
polarizability: 2.98260352e+02 1.46468062e+00 2.27683063e+02 -1.31840315e+01 -1.21321085e+01 1.39125942e+02
1716.lowfreq: -49.1847 -6.5807 -0.0010 -0.0002 0.0011 4.8779 6.0832 9.0574 22.7042
frequency: -49.1737 7.0195 22.6973 27.5313 51.8350 58.8277 74.2839 79.3475 104.1206 128.5313 137.9977 159.0246 161.8092 186.9923 200.5164 223.2629 233.5112 241.1155 250.5317 263.7282 288.5597 320.3842 328.3775 345.1699 389.6468 412.5913 445.7847 464.6493 508.1132 511.2904 541.8256 557.7082 594.4348 599.5498 617.5761 620.1855 626.9402 651.7216 679.2933 718.4665 728.4076 762.0921 786.7038 808.8528 833.3250 843.2645 850.4200 880.1365 888.1304 899.7521 920.5245 954.7752 959.7754 965.3422 972.6611 984.5042 997.9409 1003.8885 1033.1088 1068.2167 1070.7226 1072.7254 1096.0029 1127.0716 1137.0065 1152.0828 1178.6121 1192.3853 1198.8260 1207.6919 1213.2977 1225.6082 1228.1750 1255.1023 1269.8160 1272.6700 1288.1312 1289.4686 1299.3309 1303.1967 1310.9132 1341.1449 1367.2299 1381.1452 1384.7713 1399.4052 1431.0656 1449.6323 1456.4250 1463.8564 1472.7582 1474.1267 1474.7795 1478.0903 1491.8019 1562.1361 1590.4774 1630.6002 1710.5971 2968.6491 2973.2317 2973.6607 2978.7452 2986.5029 2988.8216 2996.2679 3012.7524 3033.9802 3035.8255 3040.9081 3055.1429 3060.1265 3073.8825 3079.4726 3088.4547 3156.4558 3529.2698
redmass: 1.6163 4.4423 12.9499 7.0162 7.7267 4.4283 6.8491 4.1397 5.1888 2.7956 3.2620 6.0395 5.0258 8.2136 20.8209 2.9318 5.6496 4.7574 2.6873 1.4184 5.0486 4.3924 6.9218 3.3120 8.1415 4.7179 4.8538 2.5837 4.1005 1.7738 4.0779 5.4940 6.2410 5.9200 4.8111 2.9183 1.5236 4.5089 6.8259 5.3125 3.0050 1.5802 4.2510 1.5726 4.6930 1.7131 3.9310 4.0611 2.7880 2.5030 1.8810 1.9149 4.2980 1.4195 1.6111 3.6539 1.8699 1.8769 3.2476 3.6890 2.4918 2.5142 2.8890 1.8860 3.4922 2.2282 1.4425 1.4920 1.5607 1.0756 1.5522 1.9926 1.2496 1.7100 1.3175 1.8822 1.2950 4.1610 1.3073 1.4344 1.4125 1.4892 2.5442 1.2479 4.6915 3.7699 2.3889 1.0875 1.3490 1.0861 1.0750 1.0800 1.0684 1.0578 1.0996 8.3353 8.3472 11.6759 9.5022 1.0738 1.0555 1.0668 1.0351 1.0697 1.0601 1.0605 1.0649 1.1045 1.1007 1.0988 1.0992 1.1010 1.0995 1.1045 1.1006 1.0913 1.0644
irintensity: 0.0126 0.0391 0.9701 0.0688 0.2248 0.5734 0.7366 0.2046 2.3688 8.3209 0.2110 1.6567 1.2966 0.2774 0.1760 0.2814 0.4377 0.1876 0.2507 0.0907 5.3338 0.3979 0.1102 1.2577 2.2823 10.7171 10.7691 4.6636 14.0418 45.2913 0.1317 13.3249 12.8197 13.9234 4.6352 2.9018 134.8492 35.7352 9.8875 7.8593 15.5753 3.5638 0.7223 0.8191 7.8221 17.2664 26.5121 1.8797 4.6557 14.3939 3.3979 20.7622 83.3156 2.5132 3.3173 10.3202 19.7012 0.0839 465.3631 0.0869 2.9362 4.3639 2.9146 15.3608 127.7469 32.8845 1.1101 11.7683 12.8252 1.1747 0.5317 12.5877 2.3023 116.0654 3.0715 56.4031 11.9319 195.9769 8.0484 7.8568 1.8541 5.3829 0.9361 14.5100 54.5426 83.9408 62.0715 22.8569 17.0913 0.2816 8.6030 13.0663 8.9436 2.4337 4.4689 59.2360 400.7163 86.2115 197.6506 9.4928 35.6788 13.0878 25.9705 63.7657 20.1073 35.3846 65.5671 11.3152 10.1943 26.2566 8.5581 12.1028 39.4450 88.8889 14.5318 10.1520 45.2408
temp: 298.150 k
press: 1.00000 atm
elementType: 17 17 8 8 8 8 6 6 6 6 6 6 6 6 6 6 6 6 6 6 6 6 6 1 1 1 1 1 1 1 1 1 1 1 1 1 1 1 1 1 1
symmnumber: 1
zpe: 825170.9 jmol-1
zpe.correction: 0.314291 hartree
zpe.thermalcorrener: 0.336222 hartree
zpe.thermalcorrenthalpy: 0.337166 hartree
zpe.thermalcorrgfe: 0.259506 hartree
zpe.sumelectzpe: -1877.911158 hartree
zpe.sumelectthermal: -1877.889227 hartree
zpe.sumelectthermalent: -1877.888283 hartree
zpe.sumelectthermalfe: -1877.965943 hartree
dipole: 0.0819 -7.9157 1.1224
dipole: 7.9953
quadrupole: -147.0521 -148.3829 -146.2373
quadrupole: -10.7466 2.7409 -0.9081
quadrupole: 0.1720 -1.1588 0.9868 -10.7466 2.7409 -0.9081
hfenergy: -1878.2254487 hartree
pointgroup: C01 [X(C17H18Cl2O4)]
dipole: -0.1713262 2.8481458 1.324203 debye
polarizability: 298.6341666|3.2145306|213.6343308|8.1317439|35.2003841|152.8008594 unknown
InChI: InChI=1S/C17H18Cl2O4/c1-17(10-4-2-3-5-10)7-9-6-11(23-8-12(20)21)14(18)15(19)13(9)16(17)22/h6,10,20H,2-5,7-8H2,1H3
charge 0 multiplicity 1
41 atoms
Cl -0.076587 -3.537717 -1.4024
Cl -3.177738 -2.574893 -1.312497
O  2.65228 -2.256113 -0.431765
O  -3.579492 0.016162 -0.077717
O  -5.889129 2.619816 0.939353
O  -6.299969 0.568003 -0.095517
C  3.735243 0.524364 -0.061841
C  2.54593 -0.070414 0.755213
C  3.397387 0.989048 -1.504657
C  4.415368 1.777297 0.552639
C  1.337489 0.897465 0.944744
C  4.626745 1.840391 -1.935727
C  5.280795 2.356121 -0.605783
C  1.95894 -1.291692 -0.018076
C  3.051677 -0.607503 2.125934
C  0.121113 0.138917 0.437924
C  0.484518 -1.107416 -0.130289
C  -1.218905 0.560089 0.479914
C  -0.516914 -1.949687 -0.674312
C  -2.21895 -0.285287 -0.061115
C  -1.864109 -1.543653 -0.641369
C  -3.98924 1.285618 0.505893
C  -5.504851 1.387148 0.386703
H  4.489584 -0.286448 -0.14045
H  2.483323 1.616397 -1.502036
H  3.211733 0.139436 -2.184789
H  5.020156 1.548084 1.447852
H  3.64251 2.512422 0.855842
H  1.469968 1.833328 0.369036
H  1.212421 1.193626 2.002933
H  4.333313 2.669676 -2.603834
H  5.344636 1.214885 -2.496689
H  6.320593 1.989992 -0.524954
H  5.32549 3.459306 -0.565519
H  3.819993 -1.385049 1.968231
H  3.490857 0.208979 2.726131
H  2.226081 -1.056444 2.709151
H  -1.476604 1.525992 0.923407
H  -3.711735 1.34857 1.577092
H  -3.531542 2.143566 -0.025684
H  -6.877276 2.721319 0.881331
