program: Gaussian 09
title: 000288265
version: EM64L-G09RevD.01
frameworkgroup: C1[X(C14H14N4O4)]
method: RPBEPBE
basis: SDD
operation: Freq
keyword: #p
keyword: freq=noraman
keyword: PBEPBE/SDD
title: #p freq=noraman PBEPBE/SDD
converged: YES YES NO NO
title: Mulliken charges:
elementType: O O O O N N N N C C C C C C C C C C C C C C H H H H H H H H H H H H H H
charge: -0.189345 -0.258925 -0.214109 -0.205769 -0.353320 -0.412023 0.022444 0.015681 -0.427613 -0.428666 0.325900 0.252516 -0.273150 0.468894 -0.505699 0.447485 -0.416132 -0.356986 -0.422277 -0.225041 -0.192015 -0.270122 0.221729 0.270817 0.245942 0.229925 0.357509 0.299544 0.250745 0.337354 0.292778 0.218570 0.217432 0.221501 0.225060 0.229366
chargesum: 0.00000
title: Mulliken charges with hydrogens summed into heavy atoms:
elementType: O O O O N N N N C C C C C C C C C C C C C C
charge: -0.189345 -0.258925 -0.214109 -0.205769 0.004189 -0.112479 0.022444 0.015681 0.064933 0.047202 0.325900 0.252516 -0.022404 0.468894 -0.168345 0.447485 -0.123354 -0.138416 -0.204845 -0.003540 0.033045 -0.040756
polarizability: 3.77307850e+02 -1.84746353e+01 2.09709990e+02 3.58923160e+01 1.68245554e+01 1.18278155e+02
1716.lowfreq: -2.9196 -0.0005 -0.0004 0.0005 4.3668 10.4108 18.0248 20.4929 37.9028
frequency: 17.9710 20.3090 37.8777 54.0091 57.4959 67.4291 75.6837 99.3966 159.9392 165.3166 182.8587 222.9154 245.7388 272.8288 311.9622 323.9667 335.6253 373.3240 384.4887 407.0818 408.1091 434.2981 454.6902 495.9361 508.1660 512.1015 524.3266 575.0986 610.7122 615.2932 635.2701 652.4997 664.6587 692.3128 704.8510 726.7175 751.3663 754.9248 760.4760 774.8734 803.5526 815.8068 827.4689 860.4169 873.3316 883.5039 910.2384 956.4096 969.2384 977.9009 977.9943 992.7702 1024.0503 1045.7111 1058.8129 1083.3534 1090.3663 1109.7707 1120.8422 1150.2447 1168.3936 1172.0030 1192.4474 1211.0042 1232.6418 1250.4435 1266.7532 1295.2964 1308.8018 1328.9609 1337.0590 1345.4344 1359.8675 1363.6281 1385.1732 1387.4818 1432.4904 1452.2606 1470.3635 1479.9987 1484.8916 1492.2341 1509.9551 1530.0264 1582.7280 1593.5984 1622.7357 1630.3390 2980.5796 3004.0481 3051.4870 3078.6463 3112.7509 3124.0624 3139.6405 3146.8674 3168.8148 3168.9736 3186.3499 3188.4456 3316.5267 3580.1578
redmass: 7.0086 6.5391 4.6005 5.9242 12.5610 5.8631 7.5238 7.0322 9.3176 5.3580 5.4094 3.9400 4.4455 3.6554 6.0912 5.7687 7.8074 1.1666 8.2488 2.9338 3.8303 3.4670 3.3757 3.3693 4.9948 3.2790 2.9596 3.6607 5.8234 6.3455 5.5717 6.9208 8.1035 1.8536 7.6298 4.2062 8.3524 1.8453 4.5136 3.6270 1.4049 1.2658 1.3955 3.3750 1.4953 4.4986 2.2939 1.3629 1.4046 1.9682 2.3106 1.3241 2.2786 2.5337 2.0492 2.6741 1.9972 4.4771 2.6000 1.3719 8.7645 1.0665 1.1091 3.7133 1.3851 1.5840 1.2695 1.8244 2.4344 1.4608 1.3812 3.5169 1.4015 3.8382 3.5256 4.0559 2.1537 5.0256 1.1399 1.4347 1.8616 1.7482 2.3136 3.7284 4.1525 5.0154 6.3235 7.0087 1.0634 1.0629 1.1003 1.1008 1.0877 1.0856 1.0911 1.0955 1.0878 1.1009 1.0922 1.0966 1.0789 1.0772
irintensity: 0.4426 1.4985 1.0442 1.5830 0.4625 0.8166 0.2840 1.7056 2.2091 3.0083 1.2708 5.7149 3.7291 1.9442 1.0060 0.8712 0.2175 107.3969 6.2063 3.5660 13.5448 2.4684 1.9392 10.3118 10.4896 2.7915 2.4970 2.0636 2.0022 0.9788 17.2202 15.3738 18.8235 41.5704 11.5290 0.3875 0.8867 94.0876 14.6691 21.9363 110.5487 4.1750 4.6945 1.6358 8.5424 11.6792 6.7749 0.0339 25.1005 1.9348 1.0325 0.2364 2.7885 17.0906 23.9463 4.5856 13.8814 41.1979 49.9416 22.7211 372.4104 9.5573 13.1373 516.7619 46.7573 46.3196 15.2122 80.8220 105.6381 46.6742 40.4701 144.2025 88.4689 43.6348 15.7280 31.4711 7.7933 7.8613 11.1013 37.7579 14.9865 15.7012 226.2363 66.6475 105.1275 8.1515 385.9155 160.0170 30.3983 44.9046 24.7363 20.7015 14.8503 12.3474 11.4080 46.2431 3.0158 20.0985 12.0203 13.9754 102.8035 15.9564
temp: 298.150 k
press: 1.00000 atm
elementType: 8 8 8 8 7 7 7 7 6 6 6 6 6 6 6 6 6 6 6 6 6 6 1 1 1 1 1 1 1 1 1 1 1 1 1 1
symmnumber: 1
zpe: 710217.2 jmol-1
zpe.correction: 0.270507 hartree
zpe.thermalcorrener: 0.289811 hartree
zpe.thermalcorrenthalpy: 0.290755 hartree
zpe.thermalcorrgfe: 0.219666 hartree
zpe.sumelectzpe: -1060.049303 hartree
zpe.sumelectthermal: -1060.030000 hartree
zpe.sumelectthermalent: -1060.029056 hartree
zpe.sumelectthermalfe: -1060.100145 hartree
dipole: -5.7689 -4.4668 -0.9995
dipole: 7.3642
quadrupole: -171.3010 -137.3500 -123.2924
quadrupole: -1.2336 -3.4920 8.0491
quadrupole: -27.3199 6.6312 20.6887 -1.2336 -3.4920 8.0491
hfenergy: -1060.3198106 hartree
pointgroup: C01 [X(C14H14N4O4)]
dipole: -2.272065 1.713219 -0.5449724 debye
polarizability: 371.8724175|-10.2892501|196.4457927|-53.8872888|-35.2995246|136.9777846 unknown
InChI: InChI=1S/C14H14N4O4/c19-17(20)12-6-7-13(14(10-12)18(21)22)16-9-8-15-11-4-2-1-3-5-11/h1-7,10,15-16H,8-9H2
charge 0 multiplicity 1
36 atoms
O  2.392913 -2.645318 1.902999
O  0.331064 -1.686051 2.006604
O  5.701616 1.176805 -1.797353
O  5.993491 -0.766485 -0.628409
N  -0.128253 0.5760 0.761246
N  -2.607179 0.180037 -1.023231
N  1.575289 -1.703589 1.583073
N  5.27357 0.232811 -1.020299
C  -1.08125 1.625657 0.384191
C  -1.762745 1.364821 -0.999069
C  1.164552 0.479236 0.324897
C  2.035488 -0.61711 0.716547
C  1.743734 1.474516 -0.541758
C  -3.893806 0.105677 -0.463892
C  3.37383 -0.691434 0.277651
C  3.878829 0.310231 -0.559144
C  3.064194 1.400316 -0.973068
C  -4.539397 1.235693 0.118589
C  -4.591175 -1.138869 -0.488527
C  -5.843018 1.113745 0.648367
C  -5.888274 -1.245125 0.046957
C  -6.529541 -0.120326 0.621494
H  -0.587112 2.615669 0.377467
H  -1.861491 1.655097 1.16381
H  -0.982025 1.256298 -1.773919
H  -2.352757 2.264415 -1.265169
H  -0.434265 -0.208089 1.362728
H  -2.210762 -0.681868 -1.39435
H  1.128684 2.316758 -0.866903
H  4.003168 -1.527893 0.592539
H  3.494567 2.163084 -1.627469
H  -4.04143 2.210692 0.15158
H  -4.108215 -2.019575 -0.931426
H  -6.322806 1.995945 1.088067
H  -6.402333 -2.212568 0.016238
H  -7.537948 -0.206807 1.038144
