program: Gaussian 09
title: 000288214
version: EM64L-G09RevD.01
frameworkgroup: C1[X(C12H14O3)]
method: RPBEPBE
basis: SDD
operation: Freq
keyword: #pfreq=noraman
keyword: PBEPBE/SDD
title: #p freq=noraman PBEPBE/SDD
converged: YES YES NO NO
title: Mulliken charges:
elementType: O O O C C C C C C C C C C C C H H H H H H H H H H H H H H
charge: -0.229068 -0.262736 -0.250123 -0.517787 0.302319 -0.511368 0.113247 -0.475272 0.434137 -0.364806 -0.406273 -0.215851 0.240899 -0.814268 -0.505139 0.242698 0.272673 0.257177 0.280730 0.249523 0.279200 0.236439 0.231887 0.225082 0.238540 0.231067 0.241933 0.240171 0.234968
chargesum: 0.00000
title: Mulliken charges with hydrogens summed into heavy atoms:
elementType: O O O C C C C C C C C C C C C
charge: -0.229068 -0.262736 -0.250123 -0.002416 0.302319 0.026540 0.113247 -0.225749 0.434137 -0.085606 -0.169834 0.016036 0.240899 -0.119578 0.211933
polarizability: 1.96374812e+02 -7.30992365e+00 1.45570668e+02 -3.09191643e+00 6.75903592e-03 7.65585335e+01
1716.lowfreq: -23.1172 -3.0271 -0.0003 0.0007 0.0008 6.5556 8.3574 20.0222 27.6804
frequency: -22.8161 19.7043 27.6765 43.1138 60.5015 91.1123 102.0481 149.1874 157.3817 182.9551 215.3241 219.0181 259.7107 323.0411 345.2895 413.5380 424.6430 460.8639 491.8036 521.6046 563.5551 590.7646 631.0886 668.8227 700.6325 738.8787 792.7350 822.9240 843.9225 890.1602 901.0596 943.6473 951.8063 986.4601 993.7754 1002.7250 1008.5212 1016.1787 1050.8540 1092.6836 1098.1929 1113.0702 1133.0955 1148.7408 1157.8264 1177.9510 1192.5165 1236.7011 1260.8715 1303.2528 1316.8177 1361.7698 1384.7394 1399.7456 1418.2427 1422.5128 1441.9909 1447.6904 1452.9453 1464.0630 1470.7531 1473.3735 1483.3597 1572.1056 1605.1224 1613.3276 1640.0144 2979.1859 2982.4879 3003.9878 3005.8060 3034.0950 3059.0742 3077.1579 3087.9714 3106.0632 3124.2379 3134.2988 3145.9223 3149.7170 3166.0232
redmass: 1.0191 4.7537 4.4324 4.4928 4.7302 1.0881 2.6001 4.2479 2.9255 3.7702 3.0648 5.9012 3.8901 4.3535 4.7170 3.0244 4.4745 2.9719 3.9750 4.7485 2.9271 2.7696 6.2530 5.5930 2.0796 4.7508 1.5423 1.6864 5.3173 3.0899 1.4857 1.4374 4.8815 3.2658 2.6843 1.4258 2.2198 2.1860 1.5744 2.7720 1.5228 1.2681 1.9209 1.4442 1.6096 1.1432 1.6810 1.6316 1.7194 1.5044 1.5815 1.9234 6.7211 1.2558 2.7146 1.2038 1.1041 1.1064 1.0503 1.0505 1.1599 1.3720 1.5408 6.9276 7.0103 6.0028 8.7960 1.0378 1.0614 1.0412 1.0529 1.0964 1.0969 1.0953 1.0991 1.1045 1.0878 1.0908 1.0920 1.1047 1.0979
irintensity: 0.4109 1.9607 1.0800 1.6998 2.7280 0.2927 1.1875 2.5510 0.9378 11.3966 2.4520 1.4705 21.4628 19.1904 5.0688 1.3825 0.6689 3.8032 9.0761 0.1388 15.2680 8.5106 10.4976 3.1940 20.9709 9.2068 68.6433 3.9465 2.6993 5.2150 1.4760 4.8415 41.4580 0.0894 4.5156 0.9187 2.6876 6.2579 12.8601 22.0351 11.8438 0.3825 202.2816 11.0746 131.3543 0.3284 33.0073 42.4888 94.8463 89.1803 168.8514 1.8962 0.4667 15.2380 1.3481 24.1019 1.0881 53.4474 13.8620 13.6845 17.7522 21.1510 0.8477 163.3574 17.9122 5.1391 138.2558 29.9151 26.9932 58.6434 2.1919 5.9612 18.9255 7.7638 17.5679 27.8346 9.9421 12.3516 12.9109 16.9722 16.0272
temp: 298.150 k
press: 1.00000 atm
elementType: 8 8 8 6 6 6 6 6 6 6 6 6 6 6 6 1 1 1 1 1 1 1 1 1 1 1 1 1 1
symmnumber: 1
zpe: 607383.1 jmol-1
zpe.correction: 0.231340 hartree
zpe.thermalcorrener: 0.246311 hartree
zpe.thermalcorrenthalpy: 0.247255 hartree
zpe.thermalcorrgfe: 0.186294 hartree
zpe.sumelectzpe: -690.244265 hartree
zpe.sumelectthermal: -690.229294 hartree
zpe.sumelectthermalent: -690.228350 hartree
zpe.sumelectthermalfe: -690.289311 hartree
dipole: -0.9272 2.3318 -1.0481
dipole: 2.7194
quadrupole: -62.7853 -92.9854 -91.0874
quadrupole: -1.3819 -1.9038 -2.6399
quadrupole: 19.5008 -10.6994 -8.8014 -1.3819 -1.9038 -2.6399
hfenergy: -690.4756048 hartree
pointgroup: C01 [X(C12H14O3)]
dipole: 0.3441069 -0.9193624 -0.4255093 debye
polarizability: 196.0895217|-8.3548362|145.8750653|2.3651146|0.8282687|76.5394265 unknown
InChI: InChI=1S/C12H14O3/c1-9-4-3-5-10(8-9)11(13)6-7-12(14)15-2/h3-5,8H,6-7H2,1-2H3
charge 0 multiplicity 1
29 atoms
O  -0.126653 2.287223 0.231915
O  -4.73679 0.23295 -0.331471
O  -3.421083 -1.314029 0.806604
C  -1.015973 0.041692 -0.083388
C  1.540168 0.556307 0.052457
C  -2.393585 0.714796 -0.178798
C  0.122544 1.054323 0.072937
C  1.862029 -0.822452 -0.05008
C  3.207658 -1.266946 -0.058941
C  2.589889 1.510911 0.145982
C  4.236406 -0.294772 0.029414
C  3.930049 1.084042 0.132051
C  -3.518897 -0.244778 0.158694
C  3.5339 -2.748111 -0.14813
C  -5.928433 -0.588625 -0.006034
H  -0.828296 -0.593748 -0.970021
H  -1.006733 -0.649614 0.78388
H  -2.572952 1.154818 -1.17436
H  -2.433514 1.568111 0.526696
H  1.062498 -1.569518 -0.117581
H  2.32304 2.569554 0.227211
H  5.283979 -0.619613 0.018252
H  4.740542 1.817992 0.199295
H  4.608192 -2.914817 -0.336612
H  3.274972 -3.27113 0.792224
H  2.966571 -3.239274 -0.959639
H  -6.045153 -0.676771 1.087215
H  -5.827634 -1.597251 -0.44093
H  -6.772839 -0.045968 -0.453142
