program: Gaussian 09
title: 000288227
version: EM64L-G09RevD.01
frameworkgroup: C1[X(C15H24)]
method: RPBEPBE
basis: SDD
operation: Freq
keyword: #p
keyword: freq=noraman
keyword: PBEPBE/SDD
title: #p freq=noraman PBEPBE/SDD
converged: NO YES NO NO
title: Mulliken charges:
elementType: C C C C C C C C C C C C C C C H H H H H H H H H H H H H H H H H H H H H H H H
charge: 0.262020 -0.044718 -0.584806 0.497754 -0.114365 -0.646221 -0.472003 -0.445702 -0.820795 -0.437521 -0.459175 -0.786195 0.489622 -0.833749 -0.737658 0.200292 0.209369 0.222481 0.194964 0.206663 0.218663 0.198648 0.201317 0.220445 0.197965 0.216652 0.226108 0.224922 0.210026 0.208365 0.210235 0.219194 0.214323 0.222671 0.226564 0.224670 0.223511 0.211884 0.223580
chargesum: 0.00000
title: Mulliken charges with hydrogens summed into heavy atoms:
elementType: C C C C C C C C C C C C C C C
charge: 0.262020 0.155574 -0.152956 0.497754 0.080599 -0.220895 -0.072037 -0.027292 -0.153113 -0.019130 -0.248940 -0.130008 0.489622 -0.159004 -0.302195
polarizability: 1.86953784e+02 1.80443561e+00 1.52377147e+02 -1.91321292e-01 7.85463317e+00 1.28587983e+02
1716.lowfreq: -8.4848 -0.0003 -0.0003 0.0005 2.4273 11.4786 31.0522 60.3462 100.3108
frequency: 30.9080 60.3380 100.2217 127.5905 150.9599 163.8966 175.7977 189.5747 226.5692 256.1899 271.0448 284.6291 296.9550 307.7653 317.6639 348.9628 401.0741 424.0637 429.4714 449.4196 472.2364 506.5027 525.6262 552.2839 598.9880 649.1213 684.5169 717.6545 795.3445 805.8729 812.9798 842.0905 870.1468 891.6581 892.4640 925.1017 930.1568 936.2656 943.7061 968.8241 982.0355 985.5538 1000.3270 1006.7930 1047.0605 1054.4944 1066.7825 1072.3435 1096.6399 1108.1537 1129.4654 1135.6275 1152.0012 1169.8766 1183.7454 1200.5344 1216.2485 1234.9058 1244.6279 1262.5972 1284.6160 1296.8278 1308.1365 1310.2365 1326.7672 1333.0459 1339.4668 1349.0634 1354.2596 1368.7282 1378.7624 1387.2347 1393.3023 1425.5789 1452.3476 1457.5697 1461.6573 1462.9870 1466.1403 1467.4819 1472.2740 1475.6636 1478.3775 1485.0142 1491.3777 1663.3899 1678.4339 2936.2790 2945.0675 2946.4891 2953.2946 2964.1057 2964.8026 2971.9995 2974.6465 2975.2578 2981.9456 2999.6943 3026.5606 3030.3837 3030.8783 3037.2167 3040.5985 3062.8924 3070.8724 3073.0316 3079.8336 3080.7607 3083.4160 3094.1761 3194.0611
redmass: 2.5426 3.0471 2.5404 2.7619 1.7747 1.4271 1.5897 1.3401 1.2789 2.2345 2.5505 2.8608 2.2715 2.3899 2.4881 2.0943 2.8288 2.8269 2.6124 3.4483 2.7399 2.5483 2.4356 2.2734 2.9079 3.2020 1.6373 1.4749 2.5888 1.7384 1.6137 1.4528 1.9633 2.1685 2.3827 1.3643 1.8089 1.6456 1.5517 1.9254 1.8036 1.6998 1.8364 1.5510 1.5515 1.9576 2.1624 1.6789 1.7615 2.0896 1.5665 1.8403 2.7134 2.0228 1.7012 1.8624 1.4625 1.4350 1.7338 1.4679 1.3208 1.2965 1.3849 1.4225 1.5207 1.6666 1.3809 1.5459 1.6489 1.6093 1.2174 1.2322 1.2243 1.1846 1.0799 1.0781 1.0807 1.0574 1.0865 1.0868 1.0572 1.0602 1.0600 1.0573 1.0552 4.8079 7.7178 1.0803 1.0800 1.0660 1.0647 1.0392 1.0589 1.0499 1.0590 1.0501 1.0374 1.0911 1.0943 1.1015 1.1011 1.0960 1.1029 1.0988 1.0987 1.0987 1.0933 1.0941 1.0982 1.0629 1.1129
irintensity: 0.1669 0.1193 0.0454 0.0295 0.7594 0.0901 0.1953 0.0523 0.0679 0.5658 0.7512 1.0180 0.1702 0.3910 0.6132 0.6877 0.5765 0.4095 0.3695 0.5011 3.9757 0.0962 6.4578 1.4389 0.8165 4.6236 0.9797 2.3393 0.9956 3.8396 7.3510 8.6506 3.5766 1.2969 7.2009 65.4501 6.4504 1.0531 3.8868 0.6773 3.9676 18.7583 0.6811 6.4405 4.9309 5.1527 1.0332 4.6261 2.0063 0.9770 0.2876 3.6080 9.0862 0.6732 2.9676 8.8567 1.2164 1.1755 5.5121 0.9284 9.3084 1.0731 6.9634 0.2878 0.7870 0.3439 0.3061 4.1094 3.2611 5.1664 12.5352 25.0687 20.1054 1.8652 3.2434 6.8012 9.8081 18.8262 8.7266 1.4849 5.4688 18.2076 14.5035 21.8583 2.3013 33.1373 2.8370 11.4083 7.1392 55.0223 34.6198 27.9533 26.2331 10.1680 63.2117 23.9152 40.0133 57.5727 57.8456 24.5716 33.2547 32.0231 57.8667 60.7321 30.7324 44.0167 26.2695 58.0286 28.1433 11.7690 27.1536
temp: 298.150 k
press: 1.00000 atm
elementType: 6 6 6 6 6 6 6 6 6 6 6 6 6 6 6 1 1 1 1 1 1 1 1 1 1 1 1 1 1 1 1 1 1 1 1 1 1 1 1
symmnumber: 1
zpe: 918561.3 jmol-1
zpe.correction: 0.349862 hartree
zpe.thermalcorrener: 0.365640 hartree
zpe.thermalcorrenthalpy: 0.366585 hartree
zpe.thermalcorrgfe: 0.307961 hartree
zpe.sumelectzpe: -584.787974 hartree
zpe.sumelectthermal: -584.772196 hartree
zpe.sumelectthermalent: -584.771251 hartree
zpe.sumelectthermalfe: -584.829875 hartree
dipole: -0.4246 0.4617 0.3177
dipole: 0.7031
quadrupole: -94.4620 -93.0487 -94.8052
quadrupole: 1.4639 1.9397 0.7087
quadrupole: -0.3567 1.0566 -0.6999 1.4639 1.9397 0.7087
hfenergy: -585.137836 hartree
pointgroup: C01 [X(C15H24)]
dipole: 0.1602111 -0.1624659 0.1564109 debye
polarizability: 186.9593928|1.6402472|149.3801694|1.4431532|-11.0552191|131.5793518 unknown
InChI: InChI=1S/C15H24/c1-11(2)13-8-9-14-7-5-6-12(3)15(14,4)10-13/h7,12-13H,1,5-6,8-10H2,2-4H3
charge 0 multiplicity 1
39 atoms
C  0.727602 -0.306384 0.391823
C  1.816034 -1.202862 -0.311772
C  -0.674845 -0.675698 -0.20613
C  1.003062 1.184556 0.101737
C  -1.834664 0.278334 0.212263
C  -0.129155 2.154603 0.4207
C  3.240175 -0.629339 -0.102036
C  -1.474064 1.719476 -0.213242
C  0.720502 -0.544458 1.933338
C  3.375712 0.768178 -0.739938
C  2.176587 1.638312 -0.420234
C  1.770054 -2.693149 0.098547
C  -3.180171 -0.230963 -0.3148
C  -3.752337 -1.443121 0.405478
C  -3.845507 0.343446 -1.353562
H  1.603237 -1.145994 -1.402337
H  -0.920849 -1.715396 0.082101
H  -0.607541 -0.653756 -1.313498
H  -1.900364 0.262559 1.323303
H  -0.270534 2.226284 1.520518
H  0.143566 3.16966 0.075107
H  3.987553 -1.322925 -0.534993
H  3.458738 -0.565644 0.982691
H  -2.280015 2.418643 0.082297
H  -1.382544 1.768527 -1.31695
H  0.070173 0.178552 2.455874
H  0.352636 -1.558571 2.175613
H  1.735183 -0.433877 2.355852
H  3.483566 0.673418 -1.842338
H  4.30289 1.265702 -0.38991
H  2.27743 2.714815 -0.627487
H  0.762022 -3.132581 -0.010736
H  2.457914 -3.280985 -0.537821
H  2.09106 -2.83335 1.147481
H  -4.71845 -1.754441 -0.02715
H  -3.063993 -2.30936 0.358169
H  -3.910977 -1.222425 1.479866
H  -4.804749 -0.055993 -1.704541
H  -3.464934 1.225111 -1.879583
