program: Gaussian 09
title: 000288170
version: EM64L-G09RevD.01
frameworkgroup: C1[X(C10H12O)]
method: RPBEPBE
basis: SDD
operation: Freq
keyword: #pfreq=noraman
keyword: PBEPBE/SDD
title: #p freq=noraman PBEPBE/SDD
converged: NO YES NO NO
title: Mulliken charges:
elementType: O C C C C C C C C C C H H H H H H H H H H H H
charge: -0.448592 -0.236528 -0.238577 -0.305331 -0.268870 -0.275677 -0.266123 -0.210625 -0.158726 -0.109845 -0.494062 0.256543 0.256039 0.262983 0.257094 0.257530 0.255738 0.246128 0.221627 0.229674 0.225522 0.212997 0.331079
chargesum: 0.00000
title: Mulliken charges with hydrogens summed into heavy atoms:
elementType: O C C C C C C C C C C
charge: -0.117513 0.020015 0.017462 -0.042348 -0.011776 -0.018146 -0.010385 0.035503 0.062901 0.119829 -0.055542
polarizability: 9.91970757e+01 -1.02535965e+00 8.95230667e+01 3.57938014e-01 -7.74291222e-01 8.73414833e+01
1716.lowfreq: -25.3876 -8.7463 -0.0001 0.0003 0.0004 23.7923 51.8416 222.3125 287.6142
frequency: 51.4643 222.3062 287.6134 342.0305 374.1963 456.7992 502.4887 565.4180 620.6472 630.9293 665.2645 757.4916 771.8476 778.5220 801.8218 811.6851 843.3244 848.1971 873.2304 880.4249 891.3159 942.7112 946.2355 986.9459 1015.0530 1016.2770 1030.7670 1035.7036 1064.8238 1067.1482 1077.3850 1123.7323 1128.5654 1148.5676 1152.8027 1157.2696 1160.1581 1172.7612 1201.8521 1221.0178 1232.9451 1238.2458 1244.7187 1261.1503 1268.0794 1286.4537 1314.1600 1322.5068 1342.5115 1369.1216 1450.5440 2980.3467 3018.0004 3029.1862 3035.4477 3054.5863 3059.5628 3063.8939 3076.1755 3080.9473 3091.9721 3115.3178 3538.0610
redmass: 3.4678 2.3697 1.1581 3.3677 4.5004 3.3942 3.3588 4.5059 4.0514 4.0068 4.6460 2.9953 2.0200 2.3827 2.5683 1.7333 2.7467 1.4791 1.8157 1.9976 2.5287 2.8048 3.3547 2.1444 1.8589 1.1146 2.4870 3.7840 1.8205 2.0285 1.8588 1.8379 1.3662 1.3061 1.3036 1.3425 1.5268 3.0131 1.9207 1.8356 1.9732 1.3112 1.4518 1.8368 1.4202 1.4891 2.2367 1.3889 1.4552 1.2238 1.0793 1.0615 1.0859 1.0887 1.0950 1.0906 1.0900 1.0899 1.0919 1.0920 1.0918 1.1032 1.0659
irintensity: 2.8268 4.9267 101.9356 9.9333 3.4783 5.7643 0.9816 0.9359 0.0210 6.1238 2.6240 15.3853 2.7872 3.1004 6.4594 1.0362 5.2001 0.1028 2.0204 9.1660 8.4057 14.7509 24.0500 25.4390 12.9347 1.1394 10.4743 8.2545 5.3254 0.9036 0.0539 1.8940 16.9701 5.8980 1.3686 0.4234 5.2956 3.9949 1.9312 6.0295 10.7454 0.1948 15.4509 1.8726 2.2464 3.5577 2.4110 0.4211 5.8668 34.2564 8.8334 27.8636 48.6847 10.9207 13.0129 39.7709 25.9706 10.6642 94.0302 54.0897 62.8474 53.6168 5.4758
temp: 298.150 k
press: 1.00000 atm
elementType: 8 6 6 6 6 6 6 6 6 6 6 1 1 1 1 1 1 1 1 1 1 1 1
symmnumber: 1
zpe: 509015.4 jmol-1
zpe.correction: 0.193874 hartree
zpe.thermalcorrener: 0.201659 hartree
zpe.thermalcorrenthalpy: 0.202603 hartree
zpe.thermalcorrgfe: 0.161205 hartree
zpe.sumelectzpe: -462.547085 hartree
zpe.sumelectthermal: -462.539300 hartree
zpe.sumelectthermalent: -462.538356 hartree
zpe.sumelectthermalfe: -462.579754 hartree
dipole: 2.1034 0.5921 0.2979
dipole: 2.2054
quadrupole: -74.8455 -63.6250 -60.7194
quadrupole: -1.9589 -0.6184 -0.4725
quadrupole: -8.4488 2.7716 5.6772 -1.9589 -0.6184 -0.4725
hfenergy: -462.7409588 hartree
pointgroup: C01 [X(C10H12O1)]
dipole: -0.8166125 0.2553997 -0.1440056 debye
dipolederiv: -0.6737913 0.0709698 0.2381927 0.0328789 -0.6100295 -0.0352911 0.3635276 -0.0729864 -0.3236196 0.0349218 0.0465049 0.0078563 0.0560174 0.1067884 -0.0120311 0.0006144 -0.0166883 -0.0138786 0.0697042 -0.0463378 0.0337244 -0.0606361 0.0341654 -0.0316413 0.0386535 -0.0279371 -0.0127865 -0.0877555 -0.0553325 -0.0024817 -0.0895501 0.0508916 0.0849458 0.0108782 0.1151851 0.0415212 -0.0467314 -0.0002152 -0.0484107 -0.0697306 -0.0153553 -0.0617425 -0.0617724 -0.0972902 0.1391469 -0.1012886 -0.0103793 -0.0070822 0.0226502 0.0013016 -0.0434502 0.0173325 -0.071308 0.1551211 -0.0439925 -0.0739237 -0.0739483 -0.0365171 0.0609883 0.0752056 -0.1082084 0.0905039 0.0451645 -0.0148645 0.0812275 0.0498516 -0.0191134 0.0674942 -0.0459539 0.034196 -0.0265026 -0.0373552 0.1878099 -0.044585 0.0615303 -0.0035864 0.0941215 -0.0347108 0.0598657 -0.0377574 -0.0013257 0.4778487 -0.1344762 -0.0970536 -0.0356233 0.4055176 0.052895 -0.177632 0.0749464 0.3976377 -0.0382195 0.0272595 -0.0106096 0.0468658 -0.1014489 0.0170745 -0.016913 0.0710995 0.0658702 -0.0290597 -0.1316636 0.0003015 -0.1474066 -0.1138729 0.0058491 0.0006077 0.0090982 0.0868996 -0.157263 0.0837733 -0.0808708 0.0970311 0.03778 0.0360925 -0.0845633 0.0335849 0.0606174 0.0388272 0.0656741 0.056072 0.050134 -0.0454825 -0.1044456 0.0438028 -0.111009 -0.0947035 0.0463447 0.0128319 0.0360724 0.002498 0.0349128 0.056449 0.0540257 0.0675926 -0.1829605 0.0667121 -0.0094059 0.0369776 -0.0008748 0.023979 0.0542922 0.0105954 0.0511544 -0.1961495 0.030097 0.0444062 0.0672902 0.063529 -0.0469855 -0.1060557 0.0838547 -0.1063638 -0.0873171 0.02552 0.042045 -0.0286686 0.0431979 -0.1571112 0.0659114 -0.0336315 0.0508576 0.0588295 0.010005 0.0621194 -0.0258987 0.0434956 -0.1847852 0.0655487 -0.0294827 0.0701291 0.0582459 -0.0351735 0.0262003 -0.0779727 0.0216438 0.0369458 0.0059422 -0.0799998 0.0078524 -0.119581 -0.045423 -0.0604904 0.0732763 -0.0262811 0.0392765 0.0364801 0.116045 0.0812221 -0.0229236 0.0366109 -0.0027256 -0.0245049 -0.0149705 -0.0341684 -0.0926226 -0.0767873 -0.1468882 -0.0747512 0.2491611 0.0065232 -0.1836436 0.0243483 0.315077 0.0112588 -0.1650088 -0.0084953 0.058298 unknown
polarizability: 99.2111197|0.7322153|89.4795574|0.7503003|0.7790113|87.3709485 unknown
InChI: InChI=1S/C10H12O/c11-3-1-2-4-7-5(2)9-6(3)8(4)10(7)9/h2-11H,1H2
charge 0 multiplicity 1
23 atoms
O  2.84398 -0.672801 -0.290558
C  -1.613103 -1.173068 -0.004262
C  -1.981881 0.300836 -0.419222
C  -0.253418 -1.073261 -0.8229
C  -0.780993 -0.626341 1.237821
C  -0.621051 0.421331 -1.237165
C  -1.158097 0.86304 0.819877
C  0.54829 -1.075683 0.530729
C  -0.073038 1.428928 -0.161501
C  1.777888 -0.161382 0.6098
C  1.393713 1.312398 0.282936
H  -2.273438 -2.049699 0.014545
H  -2.956446 0.678044 -0.755149
H  0.02369 -1.767744 -1.629656
H  -0.965027 -0.916421 2.282161
H  -0.561697 0.675744 -2.305673
H  -1.578357 1.510256 1.603486
H  0.815859 -2.109112 0.815839
H  -0.325521 2.465834 -0.452632
H  2.251812 -0.233833 1.60338
H  2.08049 1.687892 -0.500044
H  1.552591 1.954265 1.171061
H  2.464956 -0.742425 -1.204974
