program: Gaussian 09
title: 000288205
version: EM64L-G09RevD.01
frameworkgroup: C1[X(C14H23N3O)]
method: RPBEPBE
basis: SDD
operation: Freq
keyword: #p
keyword: freq=noraman
keyword: PBEPBE/SDD
title: #p freq=noraman PBEPBE/SDD
converged: YES YES NO NO
title: Mulliken charges:
elementType: O N N N C C C C C C C C C C C C C C H H H H H H H H H H H H H H H H H H H H H H H
charge: -0.249959 -0.017334 -0.398664 -0.654090 0.222083 0.157880 0.432541 -0.453113 -0.431170 -0.495936 -0.464029 -0.772305 -0.569759 -0.547872 -0.753074 -0.727964 0.180867 0.293316 0.199178 0.202844 0.199498 0.201704 0.205630 0.221871 0.203646 0.209077 0.229485 0.214095 0.219249 0.242457 0.204459 0.262242 0.213134 0.216358 0.227120 0.227237 0.213684 0.213382 0.282100 0.343051 0.297081
chargesum: 0.00000
title: Mulliken charges with hydrogens summed into heavy atoms:
elementType: O N N N C C C C C C C C C C C C C C
charge: -0.249959 -0.017334 -0.116564 -0.013957 0.222083 0.157880 0.432541 -0.051090 -0.029968 -0.068435 -0.051306 -0.109476 -0.122843 -0.285630 -0.096462 -0.073662 0.180867 0.293316
polarizability: 2.89609013e+02 -1.79916935e+00 1.69148464e+02 7.50191707e-01 -1.18796623e+00 1.21374575e+02
1716.lowfreq: -11.1986 -6.1722 -0.0010 -0.0008 -0.0003 10.0414 24.6140 37.9534 73.9952
frequency: 24.5456 37.4090 73.9742 82.8700 109.0175 140.5977 179.4983 195.8557 212.3046 216.8211 232.4118 245.9322 266.8306 274.9675 284.1705 294.2801 300.1715 319.2174 345.5599 363.6399 394.1544 410.7097 432.0616 446.6489 469.8434 477.6559 497.8817 510.3269 526.9786 556.3544 577.9204 591.7045 647.1437 667.8664 702.9432 708.5675 770.9333 786.7128 840.1101 853.1641 871.7674 899.2252 910.2413 927.1590 930.0308 937.5081 944.8883 961.2713 984.9911 995.3572 1023.3589 1030.6868 1034.3166 1049.9967 1066.1247 1080.4191 1113.6877 1137.2891 1146.8784 1167.8232 1186.8373 1192.6158 1198.3587 1222.8202 1233.6151 1264.0855 1288.5836 1291.7041 1314.9202 1328.9179 1330.7297 1338.9537 1344.4215 1347.6043 1355.7996 1373.4416 1384.8110 1394.0271 1448.0902 1450.6051 1458.1280 1463.5074 1466.1266 1467.4308 1475.6493 1481.0829 1484.8188 1489.4740 1490.0125 1499.3729 1552.0786 1602.7518 1614.9835 1681.8723 2944.8895 2958.1043 2960.1660 2973.0308 2975.0686 2976.9826 2978.5745 2983.9651 2991.4011 3014.7500 3020.2976 3036.9668 3040.5048 3065.3824 3067.2435 3072.0750 3081.0415 3086.6696 3094.9230 3153.9283 3407.1833 3537.7199 3696.8729
redmass: 4.2520 3.6507 4.9191 4.2694 2.5498 3.4038 1.3653 3.2289 2.7004 2.6024 1.4555 1.5325 1.4763 2.4656 1.2914 1.9489 2.3757 2.5691 2.6855 2.3932 2.1038 2.9891 2.7494 3.0075 1.9928 1.3848 2.7978 2.2776 2.2374 1.8353 3.1271 4.0127 3.2135 4.3808 4.1717 8.4467 2.6383 2.2153 2.7626 1.5317 2.3240 1.9011 1.5461 1.6030 1.9995 2.1226 1.8747 1.9230 1.5517 1.4506 1.9594 1.6497 2.4827 2.3297 1.5866 1.6329 3.5689 1.7240 2.1340 1.8464 2.5411 2.1248 1.9770 1.7102 1.7846 1.6051 2.2596 1.5207 1.5498 1.5275 1.8727 1.5094 1.6826 2.0459 1.4026 1.2238 1.2080 1.2009 1.0964 1.0764 1.0807 1.0567 1.0683 1.0834 1.0839 1.0635 1.0654 1.3058 1.3149 1.0810 7.3782 1.2417 6.6772 5.3919 1.0586 1.0596 1.0601 1.0437 1.0359 1.0590 1.0393 1.0634 1.0917 1.1009 1.0971 1.1028 1.1024 1.0989 1.0973 1.0977 1.1004 1.0992 1.0973 1.0895 1.0744 1.0459 1.1034
irintensity: 19.2605 0.4970 5.2665 2.8616 0.8047 0.3724 0.3623 2.9670 1.6576 0.7215 0.3631 1.7210 14.1347 0.7793 0.9807 1.3677 1.7718 2.4156 0.5496 5.4890 0.6147 75.3200 2.3307 9.5728 67.8314 156.2110 1.9483 7.4180 28.1160 41.9917 19.5567 12.4504 5.5397 7.1821 9.7729 15.3762 2.7866 1.9700 12.2103 4.8451 0.0196 5.2066 9.9378 4.1199 6.9392 1.3674 4.1150 3.0347 25.5888 5.8436 17.1499 13.4025 16.6061 32.4294 2.4617 3.0698 172.1896 6.4511 5.5771 39.5588 7.9042 2.7726 2.6066 1.4549 21.1708 119.6503 345.3385 59.8296 35.0705 0.6089 12.1916 5.6212 6.3306 2.4840 9.3240 11.4636 25.3328 12.9731 61.2808 3.1222 2.7041 6.3508 6.1856 17.2554 19.0730 8.3242 15.2601 148.9016 259.3595 18.3433 73.2202 166.8728 10.8617 327.9922 23.8418 27.8405 34.4979 14.9368 30.4228 56.4318 25.2819 42.0779 44.7932 30.3201 64.4987 25.0901 86.6051 13.2708 43.1178 76.0834 30.2999 21.7341 43.6690 5.3983 14.5474 55.2763 46.0461
temp: 298.150 k
press: 1.00000 atm
elementType: 8 7 7 7 6 6 6 6 6 6 6 6 6 6 6 6 6 6 1 1 1 1 1 1 1 1 1 1 1 1 1 1 1 1 1 1 1 1 1 1 1
symmnumber: 1
zpe: 926619.9 jmol-1
zpe.correction: 0.352931 hartree
zpe.thermalcorrener: 0.371634 hartree
zpe.thermalcorrenthalpy: 0.372578 hartree
zpe.thermalcorrgfe: 0.306986 hartree
zpe.sumelectzpe: -785.354035 hartree
zpe.sumelectthermal: -785.335332 hartree
zpe.sumelectthermalent: -785.334388 hartree
zpe.sumelectthermalfe: -785.399980 hartree
dipole: 1.6494 -6.2703 0.3299
dipole: 6.4920
quadrupole: -99.5973 -110.3764 -111.7387
quadrupole: 26.8065 -1.9191 0.2053
quadrupole: 7.6402 -3.1389 -4.5012 26.8065 -1.9191 0.2053
hfenergy: -785.7069663 hartree
pointgroup: C01 [X(C14H23N3O1)]
dipole: -0.5854096 -2.4853156 -0.064818 debye
polarizability: 289.2213819|5.0518646|169.3590377|-5.8899773|0.1946357|121.5516326 unknown
InChI: InChI=1S/C14H23N3O/c1-13(2)6-4-7-14(3)8-5-10(9-11(13)14)16-17-12(15)18/h9,17H,4-8,15H2,1-3H3
charge 0 multiplicity 1
41 atoms
O  4.848152 1.773274 -0.21222
N  2.293579 0.578705 -0.065862
N  3.465811 -0.152715 -0.155883
N  5.788397 -0.356856 -0.353756
C  -1.569954 -1.287121 -0.006011
C  -2.549206 1.216986 0.007413
C  -1.345294 0.243918 0.05791
C  -2.854654 -1.713825 0.769176
C  -3.767348 0.634626 0.793954
C  -0.362765 -2.001326 0.673147
C  -4.08095 -0.835819 0.457328
C  -1.676822 -1.769334 -1.488665
C  1.00674 -1.608011 0.080472
C  -0.059896 0.728471 0.080656
C  -2.208941 2.598602 0.633558
C  -2.961866 1.4737 -1.480129
C  1.148206 -0.091726 0.033596
C  4.707073 0.525574 -0.23861
H  -2.651739 -1.650138 1.858712
H  -3.066456 -2.778973 0.545138
H  -4.649419 1.275505 0.594975
H  -3.555575 0.710085 1.881054
H  -0.502186 -3.098152 0.599131
H  -0.365548 -1.741912 1.750062
H  -4.375321 -0.937116 -0.605494
H  -4.947894 -1.180074 1.053939
H  -0.841661 -1.385275 -2.100538
H  -1.660701 -2.876089 -1.527204
H  -2.614061 -1.433228 -1.963025
H  1.123651 -2.0299 -0.94001
H  1.806872 -2.061503 0.703886
H  0.136689 1.804859 0.103865
H  -3.131469 3.204786 0.70854
H  -1.49059 3.171446 0.020453
H  -1.785533 2.487649 1.648082
H  -2.098804 1.846861 -2.060143
H  -3.761545 2.23814 -1.517682
H  -3.33996 0.566838 -1.981529
H  3.45435 -1.18116 -0.163943
H  6.711134 0.065607 -0.41273
H  5.705102 -1.37008 -0.404712
