program: Gaussian 09
title: 000288172
version: EM64L-G09RevD.01
frameworkgroup: C1[X(C15H24)]
method: RPBEPBE
basis: SDD
operation: Freq
keyword: #p
keyword: freq=noraman
keyword: PBEPBE/SDD
title: #p freq=noraman PBEPBE/SDD
converged: YES YES NO NO
title: Mulliken charges:
elementType: C C C C C C C C C C C C C C C H H H H H H H H H H H H H H H H H H H H H H H H
charge: -0.304004 0.374970 0.447944 -0.624769 -0.534387 -0.594174 0.147467 -0.541446 -0.797817 0.455519 -0.467749 -0.763698 -0.784492 -0.414853 -0.862389 0.255527 0.233353 0.221481 0.213009 0.205606 0.225378 0.215039 0.207264 0.220063 0.212179 0.215462 0.211858 0.206843 0.218291 0.207384 0.225466 0.226101 0.243759 0.218713 0.201399 0.203859 0.223724 0.233551 0.218570
chargesum: 0.00000
title: Mulliken charges with hydrogens summed into heavy atoms:
elementType: C C C C C C C C C C C C C C C
charge: -0.048477 0.374970 0.447944 -0.169935 -0.115772 -0.153757 0.147467 -0.114119 -0.158319 0.455519 -0.042614 -0.104747 -0.120621 -0.210995 -0.186544
polarizability: 1.67778973e+02 -4.23198199e+00 1.52509742e+02 -3.62691503e+00 2.54074941e+00 1.33267080e+02
1716.lowfreq: -12.4104 -7.7371 -0.0007 0.0003 0.0004 16.8576 69.7622 113.1187 137.3911
frequency: 69.6196 113.0673 137.3875 168.2053 197.7906 204.0548 212.3539 222.0020 256.7593 281.5235 286.2303 300.1142 311.9625 333.3124 345.0288 351.8824 355.2715 375.6334 388.4126 442.0281 449.6574 506.6428 539.6101 559.8960 587.2855 656.6414 671.3671 714.7930 739.7329 791.0522 807.4097 824.6997 844.1618 896.7942 910.2184 914.7452 926.0123 932.0025 938.2700 959.3656 972.1459 983.1386 997.0844 1009.4851 1016.9392 1042.7947 1044.6671 1051.1704 1058.7043 1068.5748 1097.8564 1099.7586 1126.0871 1147.9472 1153.3581 1173.6178 1182.8390 1194.1955 1212.0717 1223.2188 1248.7703 1264.2032 1277.9322 1303.2218 1310.4475 1322.3618 1344.3923 1345.7272 1370.6831 1378.2467 1387.7492 1395.7608 1399.5313 1454.6729 1456.3531 1463.6661 1465.9547 1468.1001 1470.5445 1472.0148 1473.1511 1479.0717 1482.9547 1487.8446 1492.6618 1496.0204 1678.8347 2950.2771 2959.1557 2963.2016 2978.0306 2980.3646 2983.4995 2990.7968 2997.4797 3000.2442 3028.9437 3036.0184 3041.4838 3043.2994 3057.8873 3062.0572 3067.7202 3070.7601 3077.4940 3083.5022 3085.3043 3086.8624 3095.0499 3126.9962 3181.1450
redmass: 3.0865 3.1479 2.8223 2.2366 1.3868 1.2357 1.0809 1.7767 1.8557 2.1931 2.0401 2.3080 1.8205 1.9065 2.0042 2.3693 2.2638 2.1829 2.2247 2.9256 3.1069 3.0372 3.1228 3.2288 3.0922 2.2496 2.2484 3.2532 2.8208 1.7778 1.8291 1.5940 1.7174 1.9605 1.9332 1.8788 1.4750 1.6116 1.7636 1.7632 1.5962 2.1132 1.2925 1.8639 1.5539 1.4719 1.4749 1.9592 1.6032 1.5668 1.6703 2.1171 2.0013 2.2925 2.9866 1.7375 1.4677 1.9048 2.1774 1.6520 1.8130 1.4724 1.5204 2.6532 1.7177 1.6067 1.4497 1.6179 1.2043 1.8315 1.2348 1.4663 1.1939 1.0928 1.2037 1.0599 1.0567 1.0513 1.0617 1.0732 1.0854 1.0688 1.0915 1.0804 1.0580 1.0699 7.0493 1.0632 1.0364 1.0372 1.0587 1.0371 1.0705 1.0361 1.0724 1.0727 1.0999 1.0965 1.1003 1.0998 1.1025 1.0984 1.0986 1.0982 1.0958 1.0586 1.0897 1.0988 1.0996 1.0914 1.1141
irintensity: 0.0179 0.1042 0.1184 0.4579 0.6915 0.0280 0.0382 0.1910 0.8254 1.9407 0.1997 0.8471 0.1233 0.4554 0.2743 0.5015 0.3871 1.0410 0.4734 0.0223 0.3784 0.2548 0.2431 1.1906 2.0864 5.7897 2.8722 0.9403 2.0597 9.0913 4.0061 3.4493 7.0121 0.5924 1.1476 4.1076 1.1625 1.8331 1.1130 2.7947 5.1279 3.9046 1.1642 4.2800 5.2507 6.8159 14.5120 9.7184 14.5006 1.1030 11.7786 2.7099 3.6592 2.9556 9.3408 6.1211 3.2261 5.2869 1.4212 3.5081 1.2964 0.2271 0.5013 1.4587 2.6352 2.3210 1.2504 2.7841 16.9635 3.7266 11.5201 11.2449 23.2154 0.1069 10.4742 12.6916 2.9646 6.3247 5.3949 11.1298 3.6884 9.6715 10.3165 17.4457 17.2664 8.7249 2.7564 43.4197 54.7139 36.1440 45.3508 32.8505 18.5350 31.5716 37.2043 54.8898 30.3377 21.6832 66.2482 30.3528 33.6287 37.6989 21.0460 42.5434 40.4808 34.1780 56.1322 30.8291 33.8500 10.3577 19.2289
temp: 298.150 k
press: 1.00000 atm
elementType: 6 6 6 6 6 6 6 6 6 6 6 6 6 6 6 1 1 1 1 1 1 1 1 1 1 1 1 1 1 1 1 1 1 1 1 1 1 1 1
symmnumber: 1
zpe: 918236.2 jmol-1
zpe.correction: 0.349738 hartree
zpe.thermalcorrener: 0.364980 hartree
zpe.thermalcorrenthalpy: 0.365924 hartree
zpe.thermalcorrgfe: 0.310183 hartree
zpe.sumelectzpe: -584.769447 hartree
zpe.sumelectthermal: -584.754206 hartree
zpe.sumelectthermalent: -584.753261 hartree
zpe.sumelectthermalfe: -584.809003 hartree
dipole: -0.1697 0.0278 0.1524
dipole: 0.2298
quadrupole: -94.3000 -92.5662 -93.8807
quadrupole: -0.8501 -0.7846 -0.3646
quadrupole: -0.7177 1.0161 -0.2984 -0.8501 -0.7846 -0.3646
hfenergy: -585.1191852 hartree
pointgroup: C01 [X(C15H24)]
dipole: -0.0658744 -0.0185158 -0.0590782 debye
polarizability: 167.1973184|5.3195276|153.3357288|3.2235893|1.5717384|133.0227472 unknown
InChI: InChI=1S/C15H24/c1-11-6-5-7-15(13(11,2)3)9-8-14(4)10-12(14)15/h6,12H,5,7-10H2,1-4H3
charge 0 multiplicity 1
39 atoms
C  -1.022718 -0.17834 0.784795
C  -2.516784 -0.071331 0.401408
C  -0.159443 0.069013 -0.474637
C  -1.902918 0.945407 1.37312
C  -2.559056 0.40368 -1.061983
C  -1.121427 0.914837 -1.379748
C  1.245619 0.755805 -0.203878
C  0.067834 -1.313522 -1.16755
C  -3.578681 -1.050876 0.87168
C  2.229381 -0.257206 0.438834
C  0.878218 -2.294173 -0.295489
C  1.876459 1.259212 -1.544041
C  1.096378 1.994571 0.727602
C  2.047305 -1.606739 0.37479
C  3.464487 0.297986 1.135098
H  -0.691607 -0.950604 1.486545
H  -2.165967 0.848913 2.432396
H  -1.763716 1.98026 1.046216
H  -3.32288 1.18728 -1.229803
H  -2.822607 -0.452047 -1.714549
H  -0.875445 0.807921 -2.451367
H  -1.04266 1.991115 -1.138735
H  0.604681 -1.153234 -2.122467
H  -0.910566 -1.761354 -1.424575
H  -3.414567 -1.351777 1.92308
H  -4.590571 -0.605124 0.807804
H  -3.578791 -1.969969 0.253441
H  1.244033 -3.137662 -0.915868
H  0.226659 -2.758259 0.475444
H  2.886281 1.671628 -1.364094
H  1.976223 0.445931 -2.283167
H  1.264524 2.064769 -1.989765
H  0.742575 1.708372 1.732185
H  2.062065 2.520285 0.834478
H  0.378615 2.721083 0.306026
H  2.795477 -2.260276 0.848381
H  4.14637 -0.518522 1.431109
H  3.203214 0.865802 2.048352
H  4.032507 0.990143 0.482929
