program: Gaussian 09
title: 000288193
version: EM64L-G09RevD.01
frameworkgroup: C1[X(C16H21NO2S)]
method: RPBEPBE
basis: SDD
operation: Freq
keyword: #p
keyword: freq=noraman
keyword: PBEPBE/SDD
title: #p freq=noraman PBEPBE/SDD
converged: YES YES NO NO
title: Mulliken charges:
elementType: S O O N C C C C C C C C C C C C C C C C H H H H H H H H H H H H H H H H H H H H H
charge: 0.099650 -0.239522 -0.250097 -0.115215 -0.375163 -0.423409 -0.293980 -0.296758 -0.115317 0.069171 0.339570 0.324465 -0.241141 0.030407 0.486117 -0.613388 -0.611731 -0.825150 -0.826258 -0.817105 0.226617 0.235896 0.247287 0.237722 0.228821 0.204470 0.210180 0.226992 0.244513 0.236896 0.234650 0.270214 0.214423 0.224138 0.229801 0.247816 0.216088 0.222118 0.224235 0.236049 0.075927
chargesum: 0.00000
title: Mulliken charges with hydrogens summed into heavy atoms:
elementType: S O O N C C C C C C C C C C C C C C C C
charge: 0.175578 -0.239522 -0.250097 -0.115215 0.087350 0.061600 0.139311 0.140414 -0.115317 0.069171 0.339570 0.324465 0.003372 0.030407 0.486117 -0.376492 -0.377081 -0.116376 -0.132553 -0.134703
polarizability: 3.13268258e+02 1.82400635e+01 1.95856002e+02 -1.62846170e+01 1.39918361e+01 1.57039599e+02
1716.lowfreq: -31.9535 -0.0013 -0.0008 -0.0006 5.8522 7.1011 13.0422 22.5080 36.0715
frequency: -31.6337 22.3786 34.9961 45.6383 51.7316 79.4341 89.0202 108.2121 130.9819 154.9566 165.2059 170.8359 183.0554 216.1540 220.2987 253.7666 267.6741 271.3269 284.7425 320.4241 332.4780 365.4648 407.0481 428.7709 446.2495 450.0531 470.3792 489.5933 521.1306 523.9268 543.4075 562.0030 568.7383 589.6318 599.2949 645.0349 705.3230 765.1151 772.2823 795.9422 815.8010 832.7415 860.0458 865.5985 894.6058 897.0212 935.9922 941.8789 954.5676 1000.7868 1016.0812 1017.5967 1019.8515 1036.9618 1039.5369 1044.8735 1045.4942 1049.1948 1059.0785 1064.7500 1098.3645 1147.6141 1164.8236 1190.5792 1193.7926 1236.9038 1245.5692 1253.8631 1268.5210 1307.9793 1317.0182 1324.6204 1338.3141 1346.9277 1358.9017 1364.1393 1394.1246 1394.6754 1398.1138 1400.6933 1411.7862 1440.8159 1446.3619 1447.2923 1456.5203 1457.9262 1460.9529 1469.8639 1471.6931 1472.1271 1477.2803 1485.9428 1492.5809 1570.1401 1581.8439 1617.0422 2299.0724 2956.5676 2959.9951 2971.9554 2973.0971 2986.2219 2991.9197 2997.6564 3053.2888 3054.1618 3070.6316 3082.2391 3082.9359 3085.6308 3086.7067 3088.4822 3089.2852 3089.8617 3109.7993 3114.1430 3147.4801
redmass: 1.0121 4.0702 4.6357 4.4464 4.0988 3.9226 3.5789 1.1947 1.0756 4.8519 4.8534 3.5952 3.4881 3.3757 3.0886 3.3756 3.2330 3.1383 3.8633 3.5767 3.3981 3.1557 4.0371 1.9226 3.4309 1.6290 3.1056 2.9271 3.0565 5.1060 4.3118 4.1610 3.4304 2.0669 3.9353 4.3458 3.4773 3.4619 3.8251 4.1030 1.7863 1.6770 2.3423 1.4112 1.3124 2.6124 2.4001 1.3886 3.3656 2.4761 1.6753 2.2085 1.6772 1.9004 1.5804 1.5411 2.0431 1.8571 3.0735 3.3525 2.2711 3.9651 2.0056 1.0784 1.5436 1.6234 1.3691 1.4527 1.2031 3.2540 2.8939 1.2502 1.2183 1.3108 6.9204 1.3356 2.0890 1.2979 1.3091 1.2495 2.3239 1.8063 1.0899 1.0876 1.1283 1.1930 1.1114 1.1237 1.0895 1.0753 1.1784 2.4698 1.8666 6.3558 6.9139 5.8984 1.0372 1.0673 1.0674 1.0404 1.0385 1.0369 1.0651 1.0634 1.0926 1.0951 1.0966 1.0998 1.0957 1.0982 1.0981 1.0998 1.1000 1.1009 1.0909 1.0918 1.0891
irintensity: 0.4438 0.2715 0.2200 2.7180 0.9104 1.6634 5.8998 1.6437 0.5069 2.4018 2.6607 2.1452 1.8835 2.9694 0.7867 4.6037 3.5267 1.3507 22.8335 0.9774 4.7055 7.5087 3.9665 4.6496 9.5341 12.6800 3.6429 0.2444 4.6324 0.0486 16.3566 4.3996 4.9091 9.1270 9.9378 10.2812 13.3729 11.1959 11.8407 8.9871 25.0063 0.3332 64.0186 12.5150 0.0709 29.9325 2.0460 72.4850 4.2560 22.3186 8.7693 27.4302 6.8734 2.5442 3.1086 0.5141 20.3982 27.6972 45.8564 16.9543 12.6180 16.4914 61.7504 9.0166 40.7227 44.3927 57.9448 7.3308 11.8735 13.6684 15.4920 5.8413 4.9800 12.6354 1.8404 16.4392 16.5410 20.3888 13.7572 12.2653 14.2607 74.2112 12.2296 4.1380 31.2756 84.8690 20.5269 19.6800 8.0538 13.6398 33.2305 186.4596 94.5835 558.7770 85.0577 51.4100 161.5824 34.3282 38.1602 48.5729 34.4767 26.0826 37.7603 64.8344 28.9376 25.7839 21.1795 16.4094 41.3733 34.3050 9.9579 14.9083 22.5300 14.6562 31.8871 24.3307 7.8423
temp: 298.150 k
press: 1.00000 atm
elementType: 16 8 8 7 6 6 6 6 6 6 6 6 6 6 6 6 6 6 6 6 1 1 1 1 1 1 1 1 1 1 1 1 1 1 1 1 1 1 1 1 1
symmnumber: 1
zpe: 874721.4 jmol-1
zpe.correction: 0.333164 hartree
zpe.thermalcorrener: 0.353433 hartree
zpe.thermalcorrenthalpy: 0.354377 hartree
zpe.thermalcorrgfe: 0.283211 hartree
zpe.sumelectzpe: -1224.019203 hartree
zpe.sumelectthermal: -1223.998934 hartree
zpe.sumelectthermalent: -1223.997990 hartree
zpe.sumelectthermalfe: -1224.069155 hartree
dipole: 2.5044 -3.4659 -0.1309
dipole: 4.2780
quadrupole: -109.6724 -135.4716 -125.0517
quadrupole: 11.0978 -5.6206 8.0596
quadrupole: 13.7261 -12.0730 -1.6532 11.0978 -5.6206 8.0596
hfenergy: -1224.3523664 hartree
pointgroup: C01 [X(C16H21N1O2S1)]
dipole: 1.0146217 -0.7450679 -1.1172386 debye
polarizability: 305.2891828|42.2817648|167.8866337|-5.906355|15.3015372|192.9880424 unknown
InChI: InChI=1S/C16H21NO2S/c1-11-8-12(2)16(13(3)9-11)14(18)10-15(20)17-4-6-19-7-5-17/h8-10,20H,4-7H2,1-3H3
charge 0 multiplicity 1
41 atoms
S  2.148139 2.565228 1.297039
O  4.752171 -1.643798 -0.932042
O  -0.441796 1.817247 1.662562
N  3.116938 0.722107 -0.541063
C  4.481366 0.63817 0.046249
C  3.007705 -0.108108 -1.767309
C  4.8509 -0.843365 0.299641
C  3.384252 -1.576364 -1.477974
C  1.988432 1.102968 0.183379
C  -1.754041 0.195061 0.421482
C  -2.477746 -0.439407 1.479962
C  -2.276629 0.182911 -0.907147
C  0.745439 0.492927 0.04939
C  -0.462164 0.913958 0.747575
C  -4.226422 -1.129711 -0.130776
C  -3.689742 -1.1034 1.179535
C  -3.506592 -0.474688 -1.156652
C  -1.970069 -0.427671 2.912702
C  -1.578498 0.882467 -2.066797
C  -5.553078 -1.811649 -0.417186
H  4.52219 1.191025 0.998845
H  5.20734 1.085062 -0.660078
H  3.728076 0.297489 -2.505001
H  1.995071 -0.019302 -2.191982
H  5.90102 -0.93325 0.623193
H  4.18358 -1.265875 1.081692
H  2.667218 -2.031101 -0.761496
H  3.408223 -2.173271 -2.404388
H  0.663175 -0.409464 -0.564536
H  -4.231628 -1.60619 1.990857
H  -3.912883 -0.468002 -2.176561
H  -2.01211 0.591637 3.333892
H  -2.572676 -1.10063 3.546807
H  -0.912798 -0.744366 2.977829
H  -2.294648 1.084346 -2.882429
H  -1.125879 1.841252 -1.761468
H  -0.764897 0.262007 -2.490684
H  -5.624812 -2.134149 -1.470855
H  -5.698035 -2.699033 0.224344
H  -6.401663 -1.1265 -0.223921
H  3.362372 2.973134 0.723367
