program: Gaussian 09
title: 000288135
version: EM64L-G09RevD.01
frameworkgroup: C1[X(C15H14O2)]
method: RPBEPBE
basis: SDD
operation: Freq
keyword: #pfreq=noraman
keyword: PBEPBE/SDD
title: #p freq=noraman PBEPBE/SDD
converged: YES YES NO NO
title: Mulliken charges:
elementType: O O C C C C C C C C C C C C C C C H H H H H H H H H H H H H H
charge: -0.226791 -0.260635 0.229377 -0.521368 -0.426070 0.117680 -0.505006 0.197081 0.053316 0.463694 -0.410103 -0.471053 -0.386307 -0.583238 -0.384848 0.328466 -0.535991 0.223463 0.227936 0.218557 0.212803 0.227190 0.249828 0.281299 0.243317 0.234017 0.266353 0.243065 0.249079 0.222431 0.222457
chargesum: 0.00000
title: Mulliken charges with hydrogens summed into heavy atoms:
elementType: O O C C C C C C C C C C C C C C C
charge: -0.226791 -0.260635 0.229377 -0.069969 0.005290 0.117680 -0.027988 0.197081 0.053316 0.463694 -0.128804 -0.227736 -0.152290 -0.316885 -0.141783 0.328466 0.157976
polarizability: 2.98314735e+02 1.55441381e+01 1.70496918e+02 -1.21970245e+00 3.10524065e+00 8.27710178e+01
1716.lowfreq: -9.1568 -6.8124 -2.1745 0.0002 0.0004 0.0005 47.4952 64.8745 89.2367
frequency: 47.4655 64.8688 89.2303 108.2536 147.2868 180.2478 205.5813 224.3293 250.5744 282.3440 284.0311 327.4774 372.3687 407.3641 426.2429 445.4599 498.3074 505.1638 526.4164 534.5146 559.4043 573.6049 610.3232 639.6846 704.1043 709.2888 753.6444 784.3587 814.3097 835.4994 851.6000 860.6780 884.1771 907.9433 909.5457 930.4570 949.2714 996.2845 1004.1511 1016.8234 1056.5839 1091.1776 1109.0345 1109.1829 1136.1804 1143.6708 1162.6852 1177.6559 1185.6201 1201.9067 1246.9729 1254.7896 1269.9541 1288.2582 1317.1791 1320.4268 1352.2377 1369.0486 1387.7118 1420.7344 1430.5734 1434.4735 1439.1008 1454.4592 1466.2364 1467.6357 1473.4385 1473.9948 1510.5971 1561.5732 1587.0367 1607.8682 1634.1761 2951.5241 2962.4529 2966.7569 2991.3184 3032.0515 3051.8991 3052.3429 3067.6468 3126.7915 3132.0375 3145.8470 3154.9198 3160.7560 3169.0425
redmass: 4.1503 3.8042 3.9605 2.8481 4.1369 3.7875 2.1595 1.4048 4.1638 6.1778 2.2117 5.1147 4.8106 3.5653 3.5008 3.3173 4.3860 3.7544 4.0929 4.8144 3.5105 3.9073 4.2311 2.9994 4.5373 3.9090 4.1920 1.8886 2.1534 1.4359 4.3830 1.6889 2.5398 1.8488 3.2718 2.6408 1.3936 4.0013 1.3393 3.5111 2.0524 1.7795 1.7369 1.5429 1.2914 1.4408 1.4318 1.4920 1.7636 1.4998 1.3614 2.0345 1.7848 2.8524 1.6713 1.4809 1.8180 1.9860 3.3557 3.4319 5.1072 1.3654 1.1608 1.2016 1.5262 1.0508 1.2946 1.1306 3.7125 8.2379 9.5423 6.7021 6.8011 1.0669 1.0329 1.0669 1.0614 1.0914 1.1020 1.1042 1.0947 1.0994 1.0882 1.0863 1.0920 1.0963 1.0958
irintensity: 0.2259 1.2775 7.6510 2.0850 0.0640 0.1365 1.0496 0.4521 12.6660 1.0934 5.4066 1.5066 2.2592 1.4340 4.8325 3.3884 2.5428 2.7272 26.4332 3.9671 3.7827 2.4981 1.7508 0.7383 3.6016 9.2276 14.8169 12.7850 20.0482 17.0644 0.7429 5.2148 13.5753 51.0715 18.1818 3.0039 0.0892 26.9588 0.0525 63.4268 0.9039 3.5433 11.0624 7.4749 14.6900 4.7364 152.2096 23.6799 81.9736 7.0073 30.6380 172.1020 59.6258 38.2972 2.9632 25.3178 38.9515 11.0325 29.4664 9.6487 44.3262 24.0481 4.7819 38.7430 147.6200 14.0604 2.4149 14.2567 15.8760 121.2690 224.7429 2.5661 182.3923 18.1931 86.3100 12.0634 39.5482 29.6499 46.3445 49.2617 25.3404 25.8454 6.7521 5.4597 3.5866 12.8374 16.9190
temp: 298.150 k
press: 1.00000 atm
elementType: 8 8 6 6 6 6 6 6 6 6 6 6 6 6 6 6 6 1 1 1 1 1 1 1 1 1 1 1 1 1 1
symmnumber: 1
zpe: 653940.1 jmol-1
zpe.correction: 0.249073 hartree
zpe.thermalcorrener: 0.263208 hartree
zpe.thermalcorrenthalpy: 0.264153 hartree
zpe.thermalcorrgfe: 0.208104 hartree
zpe.sumelectzpe: -729.249375 hartree
zpe.sumelectthermal: -729.235239 hartree
zpe.sumelectthermalent: -729.234295 hartree
zpe.sumelectthermalfe: -729.290344 hartree
dipole: -4.3179 -4.7309 -0.2338
dipole: 6.4094
quadrupole: -96.9153 -92.6345 -101.9859
quadrupole: -5.1936 0.2509 0.9155
quadrupole: 0.2633 4.5441 -4.8073 -5.1936 0.2509 0.9155
hfenergy: -729.4984474 hartree
pointgroup: C01 [X(C15H14O2)]
dipole: 1.6993557 1.8603762 -0.0996158 debye
polarizability: 298.3332817|15.4808604|170.4723385|0.6249962|-3.295607|82.7770514 unknown
InChI: InChI=1S/C15H14O2/c1-17-11-6-8-12-10(9-11)5-7-14-13(12)3-2-4-15(14)16/h5-9H,2-4H2,1H3
charge 0 multiplicity 1
31 atoms
O  -4.183625 -1.449029 -0.051691
O  4.542228 -0.429775 0.015669
C  -1.08183 0.559108 -0.015432
C  -1.665572 1.967866 -0.052467
C  -3.11861 2.024496 0.466113
C  -1.936592 -0.567156 0.003566
C  -3.994258 0.973248 -0.243968
C  0.348578 0.354433 -0.009514
C  -3.422942 -0.433645 -0.082259
C  0.885578 -0.995122 0.052048
C  -1.392411 -1.898478 0.067897
C  -0.023775 -2.1096 0.097755
C  1.286124 1.437173 -0.072903
C  2.294549 -1.198872 0.061178
C  2.666893 1.223801 -0.070385
C  3.177734 -0.112086 0.00179
C  5.508954 0.66992 -0.056319
H  -1.040242 2.656382 0.544723
H  -1.634411 2.347548 -1.096644
H  -3.127578 1.833038 1.556943
H  -3.533562 3.037557 0.309488
H  -4.037996 1.198272 -1.331112
H  -5.03432 0.970096 0.125563
H  -2.105651 -2.728774 0.085718
H  0.3858 -3.124941 0.146623
H  0.921206 2.466802 -0.136732
H  2.705172 -2.21236 0.111142
H  3.345778 2.079728 -0.125028
H  6.494706 0.183072 -0.031908
H  5.410465 1.352412 0.809807
H  5.400409 1.241888 -0.997958
