program: Gaussian 09
title: 000288068
version: EM64L-G09RevD.01
frameworkgroup: C1[X(C6H12N2O2)]
method: RPBEPBE
basis: SDD
operation: Freq
keyword: #p
keyword: freq=noraman
keyword: PBEPBE/SDD
title: #p freq=noraman PBEPBE/SDD
converged: YES YES NO NO
title: Mulliken charges:
elementType: O O N N C C C C C C H H H H H H H H H H H H
charge: -0.413664 -0.236118 -0.290870 -0.565686 -0.081905 -0.428077 -0.408100 -0.156813 -0.478454 0.146762 0.212404 0.246486 0.182630 0.222183 0.208553 0.249648 0.216909 0.190366 0.284061 0.264858 0.254416 0.380411
chargesum: 0.00000
title: Mulliken charges with hydrogens summed into heavy atoms:
elementType: O O N N C C C C C C
charge: -0.033253 -0.236118 -0.006809 -0.046412 0.130499 0.001039 0.022636 0.092835 -0.071179 0.146762
polarizability: 1.03056099e+02 2.57794452e+00 7.77856712e+01 2.13065510e+00 -5.80700417e+00 6.72031691e+01
1716.lowfreq: -23.7626 -8.6677 -3.3577 -0.0011 -0.0007 -0.0006 54.2129 77.0243 157.2289
frequency: 54.2052 76.8975 157.2109 201.2170 215.7445 247.2842 296.6936 319.2396 345.2239 425.5475 448.9051 483.2537 551.0334 574.1645 590.3458 604.2589 621.1321 697.3187 785.4056 839.2801 875.7139 900.6728 972.8716 976.6221 1029.6854 1036.0713 1073.4001 1086.0862 1114.5222 1125.5123 1145.4620 1205.2682 1220.9957 1244.5930 1282.6027 1301.2572 1301.9765 1318.3091 1324.5812 1335.6651 1350.8247 1378.2099 1441.1462 1449.6728 1461.3891 1465.1316 1637.0482 1659.6438 2940.4255 2950.3973 2979.4263 2982.6803 2996.3593 3037.9991 3048.8630 3054.1119 3434.3691 3465.3534 3510.8201 3561.6559
redmass: 6.0697 4.6636 4.4984 2.8749 1.6018 1.2498 4.9033 3.0219 2.8390 1.8534 3.8158 3.4842 2.7804 1.3409 1.4852 1.4382 3.1076 3.7258 2.3162 1.7785 2.1870 2.3473 2.1210 2.8435 1.8750 1.6833 1.9167 3.2032 1.4907 2.5841 2.7175 1.6136 1.5149 1.5009 1.4228 1.3207 1.2447 1.3042 1.2544 1.4356 1.6152 1.5346 1.1163 1.2006 1.0983 1.1073 1.0953 8.4764 1.0665 1.0681 1.0641 1.0806 1.0817 1.0972 1.0960 1.1024 1.0445 1.0751 1.0639 1.0969
irintensity: 0.8047 0.5115 5.7707 9.9674 21.3229 30.1539 7.3898 13.7479 5.8562 9.6494 9.4764 22.3007 6.2301 37.5794 196.8974 220.6063 65.5119 79.2139 0.5932 13.9440 3.5098 4.6358 6.5681 49.1106 105.2162 0.9319 136.4247 29.5510 11.5512 1.8617 34.5840 2.0155 1.8749 0.5870 4.9327 7.2888 12.9614 1.9022 2.0935 10.5434 48.2908 4.3099 1.2416 23.5522 11.6266 1.9165 40.8162 228.5218 42.8602 27.9389 12.9531 65.7732 20.3482 49.4779 23.0357 57.7234 1.3721 9.0303 23.3760 0.1236
temp: 298.150 k
press: 1.00000 atm
elementType: 8 8 7 7 6 6 6 6 6 6 1 1 1 1 1 1 1 1 1 1 1 1
symmnumber: 1
zpe: 485754.2 jmol-1
zpe.correction: 0.185014 hartree
zpe.thermalcorrener: 0.195280 hartree
zpe.thermalcorrenthalpy: 0.196224 hartree
zpe.thermalcorrgfe: 0.149467 hartree
zpe.sumelectzpe: -494.977245 hartree
zpe.sumelectthermal: -494.966979 hartree
zpe.sumelectthermalent: -494.966035 hartree
zpe.sumelectthermalfe: -495.012792 hartree
dipole: -0.8040 0.8902 -0.5643
dipole: 1.3257
quadrupole: -55.7740 -63.5292 -61.4333
quadrupole: 10.0698 2.0366 -1.0491
quadrupole: 4.4715 -3.2837 -1.1878 10.0698 2.0366 -1.0491
hfenergy: -495.162259 hartree
pointgroup: C01 [X(C6H12N2O2)]
dipole: -0.3159147 0.1770007 -0.3753579 debye
dipolederiv: -0.7800645 -0.1567704 0.4975247 -0.1976221 -0.4720284 0.1962271 0.4725391 0.1596036 -0.7208579 -0.729608 0.0508041 -0.2180609 -0.0778965 -0.3639338 0.1314601 -0.0539071 0.2383583 -0.876694 -0.7426761 0.075525 0.0077003 0.1677962 -0.7305196 0.1215294 0.0179441 0.010078 -0.2030312 -0.8410764 0.1753892 -0.0298277 0.3129375 -0.5885113 -0.0213313 -0.0132057 -0.0083793 -0.1668113 0.5223591 -0.048134 0.0357649 0.0564575 0.2386528 0.0573124 0.0123071 0.015035 0.1874769 -0.0021571 -0.036415 0.0133956 0.0499037 0.0074614 0.0853479 0.0729105 0.0306198 0.1550141 -0.0284337 0.0228427 -0.0226492 -0.1978242 -0.0091552 -0.0069476 0.0123893 0.0315539 0.1149525 -0.1367835 0.1205186 -0.1673114 0.205886 0.4204439 0.0098722 -0.3400896 -0.0941641 0.2425099 0.4745058 0.0069769 0.037902 0.0460792 0.234619 0.0141105 0.1567949 0.0869206 0.2285262 1.437531 0.0829848 -0.0793676 0.2420118 0.3086973 -0.3641299 -0.1267404 -0.4224116 1.2898066 0.0108273 -0.0091369 -0.0399835 0.0029478 0.0022441 -0.0622265 -0.024792 -0.0640691 -0.169237 -0.0125608 0.1110408 -0.0120432 0.0791837 -0.1211062 0.009748 -0.0070184 -0.0039092 0.0759464 0.0247434 -0.022419 -0.0239808 -0.0505249 0.0443692 -0.1142365 -0.046168 -0.0397631 -0.1648011 -0.0111243 -0.0760196 0.0673139 -0.0847475 -0.0531014 0.0802178 0.0776605 0.1217953 -0.0049461 0.0372506 0.0140134 -0.0294277 0.0201795 0.0323284 -0.0410422 -0.0498492 -0.10359 -0.1211692 0.0743064 -0.0160969 -0.0190404 -0.0266187 0.0096634 -0.0334927 0.0481509 -0.0135585 -0.125967 -0.0286974 -0.0794917 0.0535551 -0.0619711 -0.0551506 0.0930071 0.0928299 0.1364447 -0.0217188 -0.0110062 -0.0083356 -0.0372682 0.0178902 0.0336166 -0.0435633 -0.1082866 -0.1246163 -0.1571705 0.1972858 -0.0659201 0.0177885 -0.1227196 0.2781433 -0.1305473 0.0065513 0.0095277 0.0534674 0.164658 -0.0900629 -0.0091873 -0.2510143 0.1644388 0.1360939 -0.0051807 0.094042 0.12268 0.1957863 -0.0334391 0.0595867 -0.1185227 0.2427595 -0.137773 -0.0288483 -0.0773006 0.0193709 0.1849342 -0.0178543 -0.1023838 -0.0118113 0.3760686 0.020364 -0.1659915 0.017783 0.2426531 unknown
polarizability: 102.9923886|3.6316478|69.663909|0.6442617|-7.2836176|75.3886412 unknown
InChI: InChI=1S/C6H12N2O2/c7-4-1-2-5(6(9)10)8-3-4/h4-5,8-9H,1-3,7H2
charge 0 multiplicity 1
22 atoms
O  3.016282 0.344803 -0.900906
O  2.602718 -0.422675 1.252731
N  0.039743 -1.254568 0.450638
N  -3.579864 0.02514 -0.01517
C  -2.142651 0.077102 0.323411
C  -1.425267 1.090847 -0.59688
C  0.084676 1.185406 -0.278475
C  0.737978 -0.241253 -0.356495
C  -1.417393 -1.305272 0.219227
C  2.181034 -0.150152 0.106556
H  -2.058395 0.437927 1.369426
H  -1.908575 2.079186 -0.49383
H  -1.561235 0.772662 -1.654129
H  0.591422 1.867771 -0.986429
H  0.226105 1.589751 0.744004
H  0.730713 -0.551325 -1.420197
H  -1.859715 -2.025143 0.933591
H  -1.601184 -1.704627 -0.8025
H  0.322612 -1.221423 1.438428
H  -4.145678 -0.529414 0.636594
H  -3.759455 -0.242765 -0.990248
H  3.941229 0.440319 -0.544349
