program: Gaussian 09
title: 000027563
version: EM64L-G09RevD.01
frameworkgroup: C1[X(C13H16N2O)]
method: RPBEPBE
basis: SDD
operation: Freq
keyword: #p
keyword: freq=noraman
keyword: PBEPBE/SDD
title: #p freq=noraman PBEPBE/SDD
converged: YES YES NO NO
title: Mulliken charges:
elementType: O N N C C C C C C C C C C C C C H H H H H H H H H H H H H H H H
charge: -0.285449 -0.495940 -0.283331 0.200186 0.222008 -0.486988 -0.470501 -0.007780 -0.432160 -0.418387 0.246380 0.200132 -0.402741 -0.417310 -0.212245 -0.533869 0.244293 0.214443 0.240182 0.181788 0.192355 0.202178 0.205785 0.194059 0.294683 0.259995 0.227358 0.228133 0.214788 0.220573 0.219260 0.238125
chargesum: 0.00000
title: Mulliken charges with hydrogens summed into heavy atoms:
elementType: O N N C C C C C C C C C C C C C
charge: -0.285449 -0.201258 -0.023336 0.200186 0.222008 -0.028253 -0.048531 -0.007780 -0.037628 -0.018544 0.246380 0.200132 -0.175383 -0.189177 0.002543 0.144089
polarizability: 2.15733149e+02 2.28456938e+00 1.73937259e+02 6.91487439e+00 -2.94359584e+00 8.79777188e+01
1716.lowfreq: -0.0008 -0.0007 -0.0004 1.5386 7.0171 10.2173 56.3573 68.1157 115.4687
frequency: 56.3544 68.1086 115.4355 138.7225 142.6866 204.3719 217.2960 244.5267 258.0629 284.5719 316.6694 346.3600 355.7393 384.5065 392.7183 446.1944 497.8708 510.7196 537.7490 546.7244 573.2001 600.4499 602.7778 614.2341 654.5682 706.5537 728.3838 734.7875 778.9416 810.9754 839.0741 853.2710 908.0653 931.2586 934.0990 942.2664 959.9627 1032.7264 1056.3809 1064.7290 1068.0019 1082.6314 1113.2046 1138.8377 1152.7056 1159.7357 1181.3406 1186.2202 1203.9131 1221.6003 1234.7450 1268.7460 1282.9401 1306.8937 1314.3934 1324.7665 1350.9805 1355.7474 1385.8194 1411.0954 1425.5356 1437.4523 1445.6883 1453.4626 1457.1373 1458.7955 1462.3994 1465.1644 1467.5437 1474.6904 1496.3551 1574.1831 1594.0583 1624.6680 2867.6418 2873.6415 2956.6179 2964.8821 2972.6627 3020.7565 3022.2568 3024.3679 3043.0692 3071.4220 3117.2819 3128.4934 3148.8554 3167.7863 3470.1200 3603.0250
redmass: 3.6864 2.9824 3.6436 3.7161 3.1826 2.3828 2.0488 2.1923 3.4641 2.4857 2.9578 3.1843 3.6344 2.3077 3.5684 2.0568 2.8073 1.1906 3.2579 3.5353 3.8046 4.2327 3.6768 1.9926 4.4753 2.9906 2.7108 2.1185 4.1385 3.1086 1.4180 2.4235 2.6270 1.3006 2.3873 6.5367 2.6816 2.1729 1.7813 2.7047 1.9581 3.4570 1.2596 3.1541 1.3247 2.6957 1.5445 1.3595 1.2457 1.5665 1.4905 1.4815 1.7610 1.6038 1.3574 1.3821 1.7561 1.8539 1.3647 3.1116 2.8283 1.2019 1.2635 1.1367 1.1107 1.2530 1.1085 1.0524 4.6930 1.1021 2.6991 7.4058 6.3737 7.5480 1.0708 1.0689 1.0327 1.0594 1.0671 1.0905 1.1009 1.0908 1.1037 1.0922 1.0994 1.0858 1.0933 1.0959 1.0755 1.0803
irintensity: 1.0575 3.5606 6.4583 0.8169 2.9913 1.0765 0.6482 0.8706 3.2437 1.2259 1.1303 4.8315 2.8068 1.8647 2.2252 65.1762 21.6941 82.3870 3.7734 0.9005 2.0550 2.4633 7.4513 55.4753 6.1090 15.9617 25.5092 47.3285 28.8250 1.6496 0.0164 2.0442 2.6902 1.9365 7.8710 18.8658 18.9428 1.6650 5.6213 19.9206 15.1369 89.3598 0.1312 10.6084 0.6896 2.6117 1.6940 24.8044 26.8633 41.6058 72.5234 11.6212 1.6389 25.6785 9.0258 12.9305 15.2652 31.4847 6.3995 15.5538 34.9795 0.4647 2.9004 3.2713 15.9512 1.7314 10.8209 12.9124 25.7457 55.8345 32.4021 35.6599 30.7884 8.6698 59.0325 126.4016 85.2835 40.1079 28.9064 68.4829 19.8929 85.8665 50.0252 8.6983 24.2824 1.8564 27.1205 22.7996 1.4116 41.8973
temp: 298.150 k
press: 1.00000 atm
elementType: 8 7 7 6 6 6 6 6 6 6 6 6 6 6 6 6 1 1 1 1 1 1 1 1 1 1 1 1 1 1 1 1
symmnumber: 1
zpe: 702366.0 jmol-1
zpe.correction: 0.267517 hartree
zpe.thermalcorrener: 0.281445 hartree
zpe.thermalcorrenthalpy: 0.282389 hartree
zpe.thermalcorrgfe: 0.227496 hartree
zpe.sumelectzpe: -688.519359 hartree
zpe.sumelectthermal: -688.505431 hartree
zpe.sumelectthermalent: -688.504487 hartree
zpe.sumelectthermalfe: -688.559381 hartree
dipole: -0.7908 -0.5472 0.9317
dipole: 1.3389
quadrupole: -78.5635 -78.7030 -100.3401
quadrupole: 7.6448 -2.6568 1.0487
quadrupole: 7.3054 7.1659 -14.4712 7.6448 -2.6568 1.0487
hfenergy: -688.7868764 hartree
pointgroup: C01 [X(C13H16N2O1)]
dipole: -0.2544248 -0.2399986 0.3939026 debye
polarizability: 214.894009|7.1584395|174.9012195|-2.2365965|-5.3826041|87.8528977 unknown
InChI: InChI=1S/C13H16N2O/c1-16-12-4-2-3-11-13(12)9-5-7-14-8-6-10(9)15-11/h2-4,14-15H,5-8H2,1H3
charge 0 multiplicity 1
32 atoms
O  1.510216 2.163829 -0.385339
N  -0.348789 -2.119939 -0.113933
N  -3.876641 0.672476 0.209442
C  -0.786629 0.115184 -0.302586
C  -1.369956 -1.155988 -0.224738
C  -1.543156 1.41846 -0.454357
C  -2.820309 -1.561817 -0.276443
C  0.652254 -0.08166 -0.234877
C  -2.74312 1.582544 0.50886
C  -3.735736 -0.728608 0.656674
C  0.899909 -1.494567 -0.116321
C  1.785234 0.785995 -0.264445
C  2.195364 -2.055092 -0.023416
C  3.085993 0.245412 -0.175464
C  3.280823 -1.162191 -0.055133
C  2.652731 3.075763 -0.438358
H  -0.839116 2.25174 -0.289931
H  -1.932582 1.520308 -1.488048
H  -3.212793 -1.452353 -1.307245
H  -2.916872 -2.631612 0.000854
H  -2.376715 1.455824 1.557882
H  -3.123462 2.617747 0.41201
H  -4.743612 -1.186254 0.647869
H  -3.338359 -0.803781 1.699695
H  -0.50532 -3.121638 -0.024693
H  -4.771274 1.073806 0.512347
H  2.351851 -3.135266 0.066209
H  3.96409 0.897232 -0.196782
H  4.303823 -1.548838 0.012216
H  3.302986 2.856384 -1.30788
H  3.252751 3.027414 0.491532
H  2.215817 4.079988 -0.546198
