program: Gaussian 09
title: 000288053
version: EM64L-G09RevD.01
frameworkgroup: C1[X(C6H4Cl2IN)]
method: RPBEPBE
basis: SDD
operation: Freq
keyword: #p
keyword: freq=noraman
keyword: PBEPBE/SDD
title: #p freq=noraman PBEPBE/SDD
converged: NO NO NO NO
title: Mulliken charges:
elementType: I Cl Cl N C C C C C C H H H H
charge: 0.142561 -0.021183 0.015305 -0.686501 0.616844 -0.265672 -0.401069 -0.009751 -0.129991 -0.383552 0.232925 0.249610 0.316868 0.323606
chargesum: 0.00000
title: Mulliken charges with hydrogens summed into heavy atoms:
elementType: I Cl Cl N C C C C C C
charge: 0.142561 -0.021183 0.015305 -0.046027 0.616844 -0.265672 -0.168145 -0.009751 0.119619 -0.383552
polarizability: 1.77169925e+02 -1.00945304e+01 1.21487278e+02 -4.75685348e-03 7.71444414e-03 3.76461126e+01
1716.lowfreq: -6.9584 -4.2183 0.0012 0.0014 0.0018 2.4823 65.9416 106.7372 133.4135
frequency: 65.9356 106.7297 133.4134 204.7169 218.2860 222.6393 284.8408 291.6676 371.7569 400.9889 446.7410 471.0681 490.7075 491.4365 576.8054 615.0925 712.4360 721.0288 801.7638 879.4138 934.0290 1001.3445 1068.7236 1131.9204 1171.2937 1323.1974 1354.7173 1388.6564 1461.2800 1544.3718 1601.1177 1635.8433 3140.4373 3171.7632 3551.9790 3698.4637
redmass: 17.4983 5.8018 24.2521 22.2139 14.8071 5.9615 5.6752 4.9457 11.0685 1.1522 9.5916 1.1719 3.6708 3.7903 5.0844 8.3415 4.4393 8.9891 1.5762 6.3371 1.3479 3.2845 2.0780 2.1733 1.3944 2.2241 4.5824 6.2024 4.2455 7.3079 2.9734 1.5097 1.0892 1.0960 1.0455 1.1037
irintensity: 0.1183 1.5893 0.7591 0.2864 0.2750 10.7910 4.0620 5.1294 2.4000 104.8616 4.7932 189.0274 0.1789 15.2468 1.5280 29.8744 0.2026 31.4621 60.6224 21.2990 0.2124 0.2856 39.9521 19.3488 1.1859 24.1782 45.6926 6.0229 187.3684 6.8907 15.7511 315.0116 9.4704 5.9099 99.9742 38.2279
temp: 298.150 k
press: 1.00000 atm
elementType: 53 17 17 7 6 6 6 6 6 6 1 1 1 1
symmnumber: 1
zpe: 225416.0 jmol-1
zpe.correction: 0.085856 hartree
zpe.thermalcorrener: 0.095858 hartree
zpe.thermalcorrenthalpy: 0.096802 hartree
zpe.thermalcorrgfe: 0.048328 hartree
zpe.sumelectzpe: -1216.693112 hartree
zpe.sumelectthermal: -1216.683111 hartree
zpe.sumelectthermalent: -1216.682167 hartree
zpe.sumelectthermalfe: -1216.730640 hartree
dipole: -2.8232 3.7399 -0.0027
dipole: 4.6859
quadrupole: -70.0236 -77.4975 -90.5993
quadrupole: -9.5606 0.0126 -0.0056
quadrupole: 9.3499 1.8760 -11.2259 -9.5606 0.0126 -0.0056
hfenergy: -1216.7789687 hartree
pointgroup: C01 [X(C6H4Cl2I1N1)]
dipole: -1.373087 1.2302189 -0.0010753 debye
dipolederiv: -0.4036994 0.0044888 0.0000157 -0.0201758 0.0509865 0.0000061 0.0000112 0.0000153 0.0341673 -0.3731546 -0.2985734 -0.0000578 -0.3339195 -0.4605813 -0.0000588 -0.0000459 -0.0000695 -0.0287045 -0.1206995 0.207247 0.0000164 0.2128173 -0.5523931 -0.0000494 0.0000559 -0.0000348 -0.0166096 -1.6543564 0.1746933 0.0005793 0.1231862 -0.1587443 -0.0002119 0.0015245 -0.0004666 -0.7126274 1.5898288 -0.3099664 -0.0004874 -0.2585381 -0.1154005 0.0000437 -0.0003249 0.0001246 0.1820416 -0.0354157 0.3666816 0.0001476 0.91698 0.4498605 0.0000597 0.0000605 0.0000998 -0.1185877 -0.3274449 0.2079021 0.0000344 -0.2568791 0.0624121 0.0000774 -0.0001213 0.0000315 -0.2298633 0.1294314 -0.2530307 -0.0000774 -0.24904 0.8073909 0.0000466 -0.0002287 0.0000008 0.0437777 -0.1194369 -0.1988828 -0.0000407 -0.0695266 0.1744462 0.0000234 0.0000147 0.0000531 -0.0590544 0.757307 0.1173549 0.0000063 -0.0263275 -0.5028481 -0.000036 0.000156 -0.0000122 -0.2043206 -0.0269269 0.0844807 0.0000223 0.0666955 -0.0563282 -0.0000179 0.0000589 -0.0000475 0.1792145 0.0602256 -0.0698571 -0.0000021 -0.0657458 -0.0119642 -0.0000035 -0.0000693 -0.0000191 0.1587021 0.249688 -0.0263896 -0.0000663 -0.0613682 0.1323433 0.0001775 -0.0005713 0.0003947 0.3905373 0.2746532 -0.0061485 -0.0000903 0.0218416 0.1808201 -0.0000571 -0.0005203 -0.0000703 0.3813269 unknown
polarizability: 178.9204988|1.1655272|119.7367038|-0.0061522|0.0066551|37.6461126 unknown
InChI: InChI=1S/C6H4Cl2IN/c7-5-3(9)1-2-4(10)6(5)8/h1-2H,10H2
charge 0 multiplicity 1
14 atoms
I  3.535025 0.408422 -0.000021
Cl -1.840717 -2.112538 -0.000131
Cl 1.373334 -2.347649 -0.00015
N  -2.852618 0.725276 0.000598
C  -1.46846 0.644693 0.000255
C  -0.803548 -0.615933 0.000082
C  -0.654406 1.814447 0.000282
C  0.605513 -0.711806 0.000016
C  0.747064 1.722552 0.000181
C  1.393656 0.463789 0.000069
H  -1.133937 2.799289 0.00045
H  1.348078 2.635969 0.000207
H  -3.316636 1.628634 -0.000496
H  -3.415448 -0.122245 -0.000042
