program: Gaussian 09
title: 000288126
version: EM64L-G09RevD.01
frameworkgroup: C1[X(C13H17N3O6S)]
method: RPBEPBE
basis: SDD
operation: Freq
keyword: #p
keyword: freq=noraman
keyword: PBEPBE/SDD
title: #p freq=noraman PBEPBE/SDD
converged: YES YES NO NO
title: Mulliken charges:
elementType: S O O O O O O N N N C C C C C C C C C C C C C H H H H H H H H H H H H H H H H H
charge: 0.908598 -0.553531 -0.515826 -0.310826 -0.302881 -0.400361 -0.235692 -0.510119 -0.350736 -0.336699 0.002516 -0.535530 -0.267934 -0.198145 0.453241 -0.397275 -0.358004 0.325204 -0.525430 -0.795726 0.265611 -0.431097 0.206215 0.328073 0.268448 0.277067 0.291817 0.281528 0.247339 0.269838 0.258699 0.259914 0.370436 0.241708 0.240278 0.227646 0.368429 0.282877 0.265749 0.384580
chargesum: 0.00000
title: Mulliken charges with hydrogens summed into heavy atoms:
elementType: S O O O O O O N N N C C C C C C C C C C C C C
charge: 0.908598 -0.553531 -0.515826 -0.310826 -0.302881 -0.015781 -0.235692 -0.182046 0.019700 0.031730 0.002516 0.009985 0.023883 0.083384 0.453241 -0.149936 -0.088165 0.325204 -0.006817 -0.086094 0.265611 0.117530 0.206215
polarizability: 2.26693858e+02 -7.68467569e+00 2.38758129e+02 9.21058028e+00 3.29285572e+00 1.54188607e+02
1716.lowfreq: -25.0403 -4.8985 0.0010 0.0018 0.0019 1.6973 2.9425 12.8749 14.3761
frequency: -24.9933 12.8321 14.0591 24.0185 31.1811 39.6677 54.3440 63.3939 75.7781 85.8997 112.2901 122.8745 131.2685 158.3948 186.4910 207.6672 210.9081 228.7394 229.5400 263.2958 278.2977 294.0725 308.8576 310.4694 326.4519 365.8011 373.4044 408.8437 415.5515 422.3751 477.5328 481.0431 501.1127 511.6546 565.4778 581.1300 586.8004 603.2861 620.3877 664.7758 692.1223 705.5989 755.2991 760.3761 771.0778 777.6205 792.7357 816.5769 831.7679 832.2434 846.6070 849.7400 871.1576 920.4022 945.1533 968.3785 981.0185 984.3753 989.8506 995.4303 996.6672 1025.3759 1043.8202 1051.0805 1080.3492 1086.7249 1120.3330 1127.0127 1182.7379 1210.1100 1219.1191 1235.7435 1248.5163 1284.1701 1285.1715 1291.6776 1303.8953 1314.3130 1329.5603 1337.2759 1354.6615 1381.3242 1388.7168 1401.9768 1422.6202 1436.5790 1447.7696 1467.0973 1468.8582 1474.5190 1532.7147 1535.5948 1590.1034 1593.4193 1602.6836 1626.2962 1659.3575 2983.0746 2984.5768 2995.8090 3023.4596 3051.9091 3064.1813 3088.1180 3094.1367 3119.7912 3140.7778 3147.7727 3164.3194 3179.2192 3274.6316 3381.6745 3384.1529 3513.2586
redmass: 1.0316 6.1571 6.0410 10.0515 6.7313 5.4896 4.0243 7.3088 6.9169 5.0174 4.2297 5.4167 6.6300 4.8772 8.1787 7.0724 4.2605 4.7479 6.9721 3.8162 4.7225 4.9072 6.0854 4.3145 4.5038 3.0107 3.4014 2.9069 5.1997 6.4265 4.5654 2.3367 3.6201 3.2390 3.5290 4.0889 5.5506 3.3779 6.9165 1.5052 2.8148 3.3542 2.1577 2.7608 2.4519 3.6277 7.7665 4.9809 1.3948 1.6742 1.6883 1.2398 3.6261 5.1894 2.6622 1.3005 2.5379 2.9769 1.3693 2.1044 2.9879 2.6101 2.4640 1.5927 2.2928 4.0164 1.2959 3.4112 1.1253 1.1797 3.1106 1.4047 1.1357 1.6468 1.8022 1.2758 1.2477 2.6034 1.2865 1.3587 1.4463 3.6844 3.6325 1.3125 1.0839 1.0799 1.1025 2.4062 1.0449 1.1101 1.7785 1.8477 6.1183 6.7775 5.4103 4.8817 9.1008 1.0643 1.0375 1.0591 1.0635 1.1003 1.0973 1.0975 1.0992 1.1010 1.0890 1.0907 1.0961 1.0952 1.0847 1.0760 1.0819 1.0639
irintensity: 0.5385 1.0642 0.2162 2.2267 2.0779 1.0022 0.1177 7.8430 2.7267 6.5583 15.2258 9.3677 6.6368 3.0863 4.0265 12.0555 2.1377 11.9225 4.4471 12.6361 16.1412 5.9203 1.3451 6.2878 13.9583 12.5021 6.6360 0.0424 32.8421 27.0554 33.5548 21.3860 42.3488 75.0715 20.6447 36.9469 8.1702 29.7815 0.9311 122.4796 87.2176 0.4309 81.5080 95.7571 98.1551 10.2237 56.7212 30.4975 52.8333 55.5954 81.4440 0.7084 14.6396 66.9430 12.7498 1.2618 1.0948 12.7284 0.0557 7.2603 12.8852 20.6978 21.4133 14.2849 217.2798 15.5717 11.8005 9.4959 5.2839 27.2499 5.9564 41.0346 32.1165 17.0194 5.9937 4.4237 3.3786 51.3210 10.1473 4.2328 2.2094 5.1245 19.3617 15.1298 32.7440 19.7559 18.9511 17.1207 14.5501 17.9840 185.0980 167.7000 27.8041 0.7379 30.2508 322.0862 286.1441 13.6740 19.2237 36.4837 24.8474 6.6462 13.8301 1.7320 18.3960 4.9289 10.6096 3.5585 6.6737 9.9221 376.4251 15.9649 144.3634 29.6278
temp: 298.150 k
press: 1.00000 atm
elementType: 16 8 8 8 8 8 8 7 7 7 6 6 6 6 6 6 6 6 6 6 6 6 6 1 1 1 1 1 1 1 1 1 1 1 1 1 1 1 1 1
symmnumber: 1
zpe: 784668.4 jmol-1
zpe.correction: 0.298864 hartree
zpe.thermalcorrener: 0.322559 hartree
zpe.thermalcorrenthalpy: 0.323503 hartree
zpe.thermalcorrgfe: 0.241151 hartree
zpe.sumelectzpe: -1517.377757 hartree
zpe.sumelectthermal: -1517.354062 hartree
zpe.sumelectthermalent: -1517.353118 hartree
zpe.sumelectthermalfe: -1517.435470 hartree
dipole: -0.4974 1.6222 -1.4962
dipole: 2.2622
quadrupole: -147.3576 -134.9910 -145.8277
quadrupole: -21.5274 13.6632 2.7059
quadrupole: -4.6321 7.7344 -3.1023 -21.5274 13.6632 2.7059
hfenergy: -1517.6766213 hartree
pointgroup: C01 [X(C13H17N3O6S1)]
dipole: -0.1474359 -0.4987686 -0.7222277 debye
polarizability: 222.2071027|3.586872|236.9372321|-11.5777855|21.3426869|160.4962594 unknown
InChI: InChI=1S/C13H17N3O6S/c1-9-2-4-10(5-3-9)23(21,22)16-7-12(18)14-6-11(17)15-8-13(19)20/h2-5,14-16,19H,6-8H2,1H3
charge 0 multiplicity 1
40 atoms
S  2.884945 0.290081 -0.100301
O  2.770517 0.731351 1.477887
O  4.348349 0.118099 -0.791663
O  -0.592796 3.640666 0.053986
O  -2.043013 -0.183223 1.919289
O  -5.196791 2.383654 0.804686
O  -5.885209 1.063128 -0.978942
N  1.863376 1.59423 -1.00719
N  0.32585 2.142748 1.587963
N  -2.588789 1.650408 0.573286
C  1.902933 -1.286503 -0.389997
C  1.732112 2.8921 -0.274769
C  2.481261 -2.250005 -1.230112
C  0.666342 -1.452844 0.255151
C  0.508002 -3.673396 -0.811348
C  1.764553 -3.451433 -1.432875
C  -0.025934 -2.660718 0.032871
C  0.388795 2.937331 0.472036
C  -0.926749 1.982287 2.345473
C  -0.255256 -4.965549 -1.03182
C  -1.911735 1.045033 1.609043
C  -3.547258 0.920096 -0.241361
C  -4.982412 1.440267 -0.20122
H  2.325061 1.693034 -1.930813
H  1.718435 3.697646 -1.027672
H  2.572057 3.072401 0.426033
H  3.458739 -2.074035 -1.690494
H  0.233858 -0.695361 0.914036
H  2.192342 -4.224702 -2.080376
H  -0.99122 -2.805514 0.530607
H  -0.69728 1.531418 3.3224
H  -1.388119 2.974909 2.495464
H  1.163169 1.579898 1.82875
H  -0.438172 -5.486841 -0.074075
H  -1.244258 -4.770264 -1.486345
H  0.292078 -5.656086 -1.694917
H  -2.30947 2.611814 0.322896
H  -3.557618 -0.126553 0.120596
H  -3.247806 0.893171 -1.305885
H  -6.151983 2.665561 0.786325
