program: Gaussian 09
title: 000027557
version: EM64L-G09RevD.01
frameworkgroup: C1[X(C12H14N2)]
method: RPBEPBE
basis: SDD
operation: Freq
keyword: #pfreq=noraman
keyword: PBEPBE/SDD
title: #p freq=noraman PBEPBE/SDD
converged: YES YES NO YES
title: Mulliken charges:
elementType: N N C C C C C C C C C C C C H H H H H H H H H H H H H H
charge: -0.497195 -0.286696 0.176160 0.229539 -0.474242 -0.466244 0.133607 -0.429552 -0.418555 0.213027 -0.420133 -0.363365 -0.257857 -0.224512 0.193654 0.223310 0.240413 0.184357 0.194036 0.204544 0.207560 0.195766 0.294434 0.263565 0.225109 0.225432 0.216260 0.217575
chargesum: 0.00000
title: Mulliken charges with hydrogens summed into heavy atoms:
elementType: N N C C C C C C C C C C C C
charge: -0.202761 -0.023130 0.176160 0.229539 -0.057278 -0.041474 0.133607 -0.030972 -0.015228 0.213027 -0.195024 -0.137933 -0.041597 -0.006937
polarizability: 2.00893212e+02 8.72099259e+00 1.44881555e+02 7.06966660e+00 -1.92990313e+00 7.69325392e+01
1716.lowfreq: -5.9103 -2.4293 -0.0004 -0.0002 0.0002 14.5684 57.9335 110.1354 159.2257
frequency: 57.9132 110.1276 159.2159 182.2104 219.0180 246.8596 312.3522 346.0149 382.8684 389.4879 432.8380 450.0590 488.1935 505.0662 523.5886 567.7164 580.1774 606.0547 631.6250 678.7123 706.4195 745.9993 761.7929 788.7138 846.3022 847.3131 861.7929 914.6816 924.8287 933.6219 961.5253 965.1283 1011.3987 1031.2769 1059.9341 1066.4407 1108.6068 1145.4067 1159.0892 1170.3643 1185.9892 1201.6010 1225.4885 1241.8531 1262.5276 1285.2502 1308.4884 1319.1670 1328.0782 1348.6501 1357.3161 1387.3188 1410.8157 1431.8671 1446.2819 1450.8374 1452.5976 1459.0132 1460.7414 1470.8086 1481.1770 1577.5116 1590.9723 1631.5089 2871.6617 2876.4710 2965.2210 2968.0937 3022.0916 3023.7229 3026.6706 3028.1467 3118.8284 3126.1868 3140.5578 3159.2518 3479.9479 3602.8355
redmass: 3.5941 3.0661 2.9242 4.2369 2.5536 4.3645 2.8327 3.1278 2.2714 3.2549 2.8756 1.8250 3.4892 1.2105 2.8821 3.6643 2.9819 1.8748 4.4887 4.7941 3.3176 1.4019 3.5628 3.0073 1.5093 2.4836 3.7257 2.6196 1.3862 2.3274 2.7409 1.3233 2.0408 2.1732 1.7908 2.4528 1.9032 2.2928 1.6829 1.5729 1.5200 1.2656 1.3243 1.7174 1.3337 1.8552 1.3343 1.3726 1.3632 1.5732 1.8120 1.3611 3.8014 1.8894 1.3988 1.1315 1.1099 1.2602 1.1103 4.4205 3.1438 7.0027 6.4829 6.8363 1.0707 1.0687 1.0593 1.0613 1.1002 1.0926 1.0956 1.0923 1.0844 1.0887 1.0949 1.1000 1.0757 1.0802
irintensity: 1.1064 0.1291 3.8026 0.3776 1.0988 1.5040 0.7828 10.1228 1.2969 2.1406 5.2177 67.8493 15.0356 67.5862 33.7100 0.3404 4.1427 47.1779 9.3377 2.8477 10.7030 93.8624 6.4701 0.1408 0.0892 2.7568 1.2176 3.6071 2.9891 14.9184 11.5960 0.3192 9.5842 1.4523 0.2295 3.3026 3.7112 6.0733 2.0484 7.0292 17.5872 9.2570 6.1742 17.3879 3.8040 3.2153 2.5000 35.4311 8.0074 20.5169 19.2660 7.7914 22.3663 19.0109 1.8119 5.3850 5.1571 2.7098 14.4088 39.0456 6.2382 2.1467 6.0697 0.6688 56.1649 126.7427 41.8671 29.0588 33.3068 47.8050 89.1941 29.1762 2.5908 4.3684 41.5872 35.2193 0.5806 39.8990
temp: 298.150 k
press: 1.00000 atm
elementType: 7 7 6 6 6 6 6 6 6 6 6 6 6 6 1 1 1 1 1 1 1 1 1 1 1 1 1 1
symmnumber: 1
zpe: 619703.2 jmol-1
zpe.correction: 0.236032 hartree
zpe.thermalcorrener: 0.247252 hartree
zpe.thermalcorrenthalpy: 0.248196 hartree
zpe.thermalcorrgfe: 0.199328 hartree
zpe.sumelectzpe: -574.168899 hartree
zpe.sumelectthermal: -574.157679 hartree
zpe.sumelectthermalent: -574.156735 hartree
zpe.sumelectthermalfe: -574.205603 hartree
dipole: -2.2471 -1.7418 0.8572
dipole: 2.9695
quadrupole: -75.4295 -69.4524 -88.8654
quadrupole: -1.2839 -2.3693 -0.0869
quadrupole: 2.4862 8.4634 -10.9496 -1.2839 -2.3693 -0.0869
hfenergy: -574.4049312 hartree
pointgroup: C01 [X(C12H14N2)]
dipole: -0.8845881 -0.6780663 0.3502465 debye
polarizability: 201.1746574|8.3073207|144.7488302|5.4524542|-2.2562134|76.7838189 unknown
InChI: InChI=1S/C12H14N2/c1-2-4-11-9(3-1)10-5-7-13-8-6-12(10)14-11/h1-4,13-14H,5-8H2
charge 0 multiplicity 1
28 atoms
N  0.312698 -1.718636 -0.050276
N  -3.599055 0.518757 0.077489
C  -0.457126 0.424927 -0.238537
C  -0.840546 -0.920857 -0.200913
C  -1.372887 1.614768 -0.416744
C  -2.206832 -1.545454 -0.32161
C  0.989459 0.45747 -0.105244
C  -2.646676 1.586959 0.462609
C  -3.288082 -0.848311 0.543354
C  1.447809 -0.904452 0.012338
C  1.949432 1.504351 -0.0730
C  2.811714 -1.236665 0.160076
C  3.31291 1.180385 0.074186
C  3.740992 -0.175556 0.189573
H  -0.810857 2.538835 -0.176933
H  -1.69951 1.702308 -1.472957
H  -2.551893 -1.512617 -1.37449
H  -2.155762 -2.613219 -0.025198
H  -2.336538 1.498878 1.533331
H  -3.171883 2.554276 0.345315
H  -4.217639 -1.445336 0.477116
H  -2.950964 -0.863521 1.609559
H  0.307142 -2.734184 0.017839
H  -4.567944 0.779512 0.289849
H  1.637801 2.55153 -0.163173
H  3.144576 -2.277395 0.247744
H  4.061431 1.980511 0.100044
H  4.80863 -0.395665 0.302054
