program: Gaussian 09
title: 000288030
version: EM64L-G09RevD.01
frameworkgroup: C1[X(C10H11NO4)]
method: RPBEPBE
basis: SDD
operation: Freq
keyword: #p
keyword: freq=noraman
keyword: PBEPBE/SDD
title: #p freq=noraman PBEPBE/SDD
converged: YES YES NO NO
title: Mulliken charges:
elementType: O O O O N C C C C C C C C C C H H H H H H H H H H H
charge: -0.422614 -0.205836 -0.438774 -0.322395 -0.419851 -0.151383 0.326976 0.071278 -0.733321 -0.353712 0.184794 -0.298408 -0.225281 -0.260719 0.144490 0.259940 0.375305 0.244184 0.236960 0.240382 0.252324 0.273113 0.226485 0.232496 0.379952 0.383616
chargesum: 0.00000
title: Mulliken charges with hydrogens summed into heavy atoms:
elementType: O O O O N C C C C C C C C C C
charge: -0.042662 -0.205836 -0.055158 -0.322395 -0.044546 0.108557 0.326976 0.071278 -0.011795 -0.101388 0.184794 -0.025296 0.001204 -0.028223 0.144490
polarizability: 1.65647053e+02 2.26132155e-01 1.55791428e+02 1.11205755e+01 -3.33641376e+00 7.60314257e+01
1716.lowfreq: -8.1636 -4.9680 -3.8983 -0.0008 -0.0007 -0.0003 19.3105 40.6312 49.3280
frequency: 19.0299 40.5978 49.3162 96.8555 118.0092 136.8301 180.9712 223.7495 236.6369 248.2245 285.0086 315.8600 339.7745 395.0718 424.2136 476.1672 524.6199 536.1188 570.7986 582.8056 608.5849 613.5483 637.8946 682.3819 713.2664 723.5487 742.0831 759.8740 775.5073 781.5654 833.2458 859.4171 953.9065 966.6367 987.7277 1006.0213 1021.5078 1045.0305 1051.9940 1095.3194 1110.1542 1164.3943 1177.8524 1191.9954 1240.0853 1261.9237 1302.7163 1323.0721 1345.0374 1356.0266 1391.1314 1394.8105 1444.9655 1451.3274 1472.4491 1479.8447 1516.4818 1583.2122 1600.3324 1638.2117 1678.9079 2997.0374 3013.4661 3100.4522 3107.4557 3130.3284 3154.2080 3163.3262 3180.7645 3342.4458 3507.1681 3533.9810
redmass: 10.6913 5.9889 5.6650 9.5941 3.9918 4.3932 4.6428 2.3371 1.4236 3.8854 4.6490 5.0581 5.6445 7.9026 3.1124 5.1387 3.0387 4.7473 1.1952 3.6392 2.8715 2.7880 2.5072 3.9611 3.7457 1.2758 5.0639 1.6723 2.8463 2.2390 4.0565 1.5131 2.0476 1.3718 1.3319 5.3900 3.0883 2.2088 1.7581 2.5951 1.9030 1.7128 1.1716 1.8324 1.5438 1.7180 1.3790 2.2331 2.0033 1.5003 1.2277 6.3837 2.4513 2.3691 1.0442 1.0808 3.0344 6.5383 2.8676 5.7136 8.4440 1.0352 1.0846 1.1012 1.1004 1.0866 1.0897 1.0949 1.0984 1.0808 1.0641 1.0641
irintensity: 1.6837 0.4349 1.0574 0.0711 0.6336 0.4027 2.3074 0.7692 0.4688 0.3036 1.2783 0.3051 1.1894 15.6585 12.2926 38.5623 12.4103 7.2138 117.9571 42.2856 54.4967 31.9055 80.9156 34.6716 24.3069 65.7120 3.9211 118.4510 4.9868 1.2722 4.8466 1.5424 2.1973 1.9100 0.2859 281.9905 278.6192 17.8796 28.4712 5.7353 135.6099 115.0181 10.6616 35.4681 8.2896 13.3141 2.5386 111.5221 68.9975 16.2252 37.0701 1.4846 26.3710 31.1659 19.9547 21.6950 224.3986 135.6805 120.2886 301.6022 170.5016 15.6771 16.8998 17.3711 19.7408 7.9324 13.4509 11.2752 10.9919 121.8542 23.5097 57.9397
temp: 298.150 k
press: 1.00000 atm
elementType: 8 8 8 8 7 6 6 6 6 6 6 6 6 6 6 1 1 1 1 1 1 1 1 1 1 1
symmnumber: 1
zpe: 520467.0 jmol-1
zpe.correction: 0.198235 hartree
zpe.thermalcorrener: 0.212436 hartree
zpe.thermalcorrenthalpy: 0.213380 hartree
zpe.thermalcorrgfe: 0.155520 hartree
zpe.sumelectzpe: -742.238416 hartree
zpe.sumelectthermal: -742.224215 hartree
zpe.sumelectthermalent: -742.223271 hartree
zpe.sumelectthermalfe: -742.281132 hartree
dipole: -1.3178 1.0666 -1.4641
dipole: 2.2401
quadrupole: -72.8553 -79.4705 -93.3540
quadrupole: -4.1278 3.2677 2.9183
quadrupole: 9.0379 2.4228 -11.4607 -4.1278 3.2677 2.9183
hfenergy: -742.4366513 hartree
pointgroup: C01 [X(C10H11N1O4)]
dipole: 0.3369827 -0.7931935 -0.1843842 debye
dipolederiv: -0.6810489 0.3965345 -0.03044 0.3996698 -0.9352073 0.1536622 -0.1829183 0.271623 -0.3258892 -0.4475072 -0.0250397 -0.1622757 0.0960011 -0.7625171 -0.1202424 -0.2042078 -0.2935041 -0.6051203 -1.1374981 0.6789827 -0.1848337 0.5479086 -0.7314592 0.0142345 -0.0877902 -0.0455807 -0.367975 -0.7193813 -0.1620292 0.2309221 -0.0327449 -0.8351344 0.3276352 0.1471107 0.3669237 -0.6230908 -1.4375916 0.012145 0.2561447 -0.2325428 -0.3111189 0.060097 0.6301333 -0.0243322 -0.6275847 0.9095305 -0.0884739 -0.0516993 -0.3317143 0.2170186 0.1410784 -0.0048918 0.05127 0.0475919 1.1221848 -0.0042806 -0.2825652 0.6850697 0.192867 -0.2311073 -0.771247 -0.0322672 0.3955431 -0.3655502 -0.1357435 0.1700533 0.4055231 -0.7642212 0.3082899 -0.1382342 0.4775353 -0.3155198 -0.0747148 -0.007456 -0.052464 0.0003488 0.0668266 -0.0219727 -0.0008878 0.020352 0.0172205 -0.243334 -0.0031567 0.0250592 -0.5900456 -0.1234471 0.097614 0.3522705 -0.0687311 -0.2914106 0.5040756 -0.3438536 0.4112766 -0.3956738 1.3011996 0.0398343 0.5185445 0.1072799 0.788149 -0.0185618 0.2704818 -0.1932354 -0.1769311 0.3363575 -0.1971792 0.0805375 -0.3518636 0.1047052 0.485831 -0.2912281 -0.0133429 -0.0433446 0.1518534 -0.1345972 -0.1815409 -0.0599451 -0.0125208 -0.2377928 0.2072237 -0.1339395 0.275112 -0.4801767 0.0684511 -0.1623694 0.0843715 -0.2151921 1.3148346 -0.4211174 -0.1096479 -0.5992193 1.6609205 -0.6978308 -0.0033695 -0.7230847 0.6872464 -0.0137987 -0.0421876 0.0032823 0.0647027 -0.1028072 -0.0554813 -0.0353798 0.0076252 0.0604089 0.2496724 -0.0519084 0.0355197 -0.1102 0.3057544 0.009674 0.0377476 -0.0235256 0.2925172 0.0789092 -0.0200349 -0.0937241 -0.0272224 0.0893256 0.0164185 -0.0791814 -0.0096836 -0.0929608 -0.1114159 0.0688238 0.0393161 0.0992268 0.0508273 -0.0031657 0.0045495 0.0225797 0.106307 0.1127144 0.0063645 0.0016499 -0.0506402 -0.0912399 -0.0020489 0.0104906 -0.0645493 0.063391 -0.0368709 0.094457 0.0115931 0.090014 0.0745553 0.0356543 0.0230534 0.0285731 0.13163 0.0132027 0.0542647 0.014325 0.0697338 0.0982982 0.0095005 0.0046178 0.0143457 0.1433317 0.1009189 0.0216179 0.0017127 0.0074597 -0.0546252 0.1186204 0.0115781 0.117776 0.0712994 -0.0470182 -0.0482389 0.1029186 -0.0387316 0.0773497 0.0729999 0.1014651 0.0765126 0.0923905 0.3400039 -0.0333324 -0.0964127 -0.038648 0.2904214 -0.101066 -0.132596 -0.0629368 0.1712181 0.3402064 -0.132815 0.100807 -0.0731114 0.278379 0.0909272 0.0625156 0.1132361 0.3043141 unknown
polarizability: 160.9965024|-13.9518858|133.9680249|-16.5942025|-34.9691951|102.5053791 unknown
InChI: InChI=1S/C10H11NO4/c1-6(9(12)13)11-8-5-3-2-4-7(8)10(14)15/h2-6,11-12,14H,1H3
charge 0 multiplicity 1
26 atoms
O  3.297821 -1.804552 0.836057
O  2.78808 0.431089 1.234437
O  -3.043523 2.157001 -0.801851
O  -0.847826 2.090816 -1.521781
N  0.64556 -0.011727 -0.794353
C  1.933941 -0.691753 -0.828916
C  -0.460735 -0.470296 -0.102024
C  -1.702515 0.274523 -0.125072
C  2.823947 -0.068952 -1.930726
C  -0.425349 -1.691773 0.644876
C  2.682514 -0.581052 0.516853
C  -2.838606 -0.222372 0.574507
C  -1.564988 -2.154354 1.319966
C  -2.78482 -1.426525 1.291022
C  -1.786383 1.538508 -0.862343
H  1.800194 -1.769031 -1.039955
H  0.538321 0.90712 -1.253289
H  2.330228 -0.176468 -2.91161
H  3.802181 -0.576354 -1.972622
H  2.992746 1.004012 -1.730732
H  0.500306 -2.272318 0.70068
H  -3.759436 0.36617 0.537137
H  -1.504842 -3.093406 1.88241
H  -3.665425 -1.796859 1.824154
H  3.817954 -1.705532 1.679804
H  -2.995547 3.002785 -1.322529
