program: Gaussian 09
title: 000288054
version: EM64L-G09RevD.01
frameworkgroup: C1[X(C13H10Cl2INO2S)]
method: RPBEPBE
basis: SDD
operation: Freq
keyword: #p
keyword: freq=noraman
keyword: PBEPBE/SDD
title: #p freq=noraman PBEPBE/SDD
converged: YES YES NO NO
title: Mulliken charges:
elementType: I Cl Cl S O O N C C C C C C C C C C C C C H H H H H H H H H H
charge: 0.175419 -0.000589 0.028245 0.960163 -0.514251 -0.512663 -0.535989 -0.081181 0.502875 -0.253774 -0.218393 0.450031 -0.355457 -0.363162 -0.249286 -0.319942 -0.795984 -0.013103 -0.154975 -0.387486 0.299664 0.283579 0.284400 0.247322 0.247578 0.305063 0.233041 0.232562 0.246024 0.260269
chargesum: 0.00000
title: Mulliken charges with hydrogens summed into heavy atoms:
elementType: I Cl Cl S O O N C C C C C C C C C C C C C
charge: 0.175419 -0.000589 0.028245 0.960163 -0.514251 -0.512663 -0.236326 -0.081181 0.502875 0.029804 0.066007 0.450031 -0.108135 -0.115584 -0.249286 -0.014878 -0.084356 -0.013103 0.105294 -0.387486
polarizability: 3.12862943e+02 -2.40724826e+01 2.11113093e+02 2.92652697e+01 1.42045249e+01 1.85964370e+02
1716.lowfreq: -6.4509 -4.9453 -2.6667 -0.0020 -0.0018 -0.0012 8.7289 14.9079 32.6442
frequency: 8.5947 14.5451 32.6120 37.8092 49.5935 61.5126 72.6969 102.2327 124.6703 135.9206 149.3208 178.7847 183.3326 209.6682 226.5190 232.3780 242.9570 282.5202 296.9194 317.4301 363.5753 372.1636 388.3857 405.9576 410.2010 437.7470 450.9244 500.6169 503.4875 512.3178 577.0822 582.0737 620.1276 631.3439 702.5575 714.0230 721.5664 774.5815 785.2936 814.7583 824.4938 833.9074 845.8492 876.2274 952.4829 960.8942 964.7798 981.3850 989.8664 993.3824 1019.1329 1047.6882 1049.5473 1120.5227 1130.0440 1159.0294 1185.8286 1219.0486 1250.0388 1274.5819 1297.8008 1355.0683 1367.0631 1381.0710 1392.2209 1400.0375 1418.3748 1469.9984 1470.5555 1475.8085 1525.5789 1568.0241 1592.1521 1592.6521 2982.7054 3066.0192 3095.9989 3137.9018 3139.9753 3161.5848 3166.4249 3167.6599 3187.1675 3393.7167
redmass: 7.3404 7.1475 4.7704 1.0428 6.7031 10.2329 15.2449 5.7562 6.6216 19.1532 10.4554 10.5551 10.9709 30.7849 8.7434 6.6634 12.0435 5.4031 4.9231 7.1712 4.6313 8.1424 5.0857 2.8822 6.2024 8.8314 11.1081 3.1838 4.1282 3.7638 5.5494 5.7554 6.9596 8.8561 3.3127 5.7794 7.7451 3.9544 1.7090 3.8907 1.3545 1.8479 1.2478 7.3175 1.7656 1.2978 3.4786 1.4217 5.5438 1.4551 7.0341 2.4307 1.6056 1.2880 2.4080 1.6279 1.1407 3.0131 1.5582 2.4256 1.2650 3.8637 4.2077 5.6250 3.1122 1.2170 2.8008 1.1139 2.2689 1.0636 6.4858 7.0384 6.3594 6.3875 1.0392 1.0945 1.1002 1.0889 1.0894 1.0960 1.0966 1.0892 1.0974 1.0751
irintensity: 1.0308 1.2655 0.5173 0.4995 0.1463 2.0726 2.1956 0.9542 1.3904 0.2086 0.0587 4.1001 4.8953 0.0380 7.4635 7.4247 1.9583 6.7801 0.3626 2.1275 10.9248 15.8258 1.7360 0.0215 7.2188 93.8329 18.5046 86.3511 20.1488 18.9600 17.0815 15.3564 0.6839 37.4670 1.3894 1.3808 28.7959 3.5567 57.6803 141.0125 40.1346 77.9223 1.2827 31.7258 17.9648 0.6534 34.4707 1.6701 2.1416 3.4666 12.4471 28.5444 21.3882 8.2081 19.0039 17.1555 10.8007 8.6760 16.2801 13.0542 2.6561 3.3809 44.6780 0.3780 10.4878 17.8079 129.0687 16.9080 20.0760 14.1047 3.3072 10.5490 8.0517 6.6294 19.2290 14.4627 12.9596 10.7733 5.3763 2.7335 6.5202 2.2718 1.0646 33.3643
temp: 298.150 k
press: 1.00000 atm
elementType: 53 17 17 16 8 8 7 6 6 6 6 6 6 6 6 6 6 6 6 6 1 1 1 1 1 1 1 1 1 1
symmnumber: 1
zpe: 518659.5 jmol-1
zpe.correction: 0.197547 hartree
zpe.thermalcorrener: 0.218464 hartree
zpe.thermalcorrenthalpy: 0.219409 hartree
zpe.thermalcorrgfe: 0.142141 hartree
zpe.sumelectzpe: -2034.653890 hartree
zpe.sumelectthermal: -2034.632973 hartree
zpe.sumelectthermalent: -2034.632029 hartree
zpe.sumelectthermalfe: -2034.709296 hartree
dipole: -0.1684 5.8146 -0.3480
dipole: 5.8275
quadrupole: -154.9097 -153.2435 -150.8917
quadrupole: 26.6560 10.5982 -5.1884
quadrupole: -1.8948 -0.2285 2.1233 26.6560 10.5982 -5.1884
hfenergy: -2034.8514374 hartree
pointgroup: C01 [X(C13H10Cl2I1N1O2S1)]
dipole: 0.3796859 2.2472292 -0.2496376 debye
polarizability: 293.3721759|-39.067678|224.1803609|44.2073046|2.4316033|192.3878687 unknown
InChI: InChI=1S/C13H10Cl2INO2S/c1-8-2-4-9(5-3-8)20(18,19)17-11-7-6-10(16)12(14)13(11)15/h2-7,17H,1H3
charge 0 multiplicity 1
30 atoms
I  -5.156621 1.297756 -1.27321
Cl -1.014543 0.106144 2.791348
Cl -3.543332 1.827278 1.782724
S  1.412509 -2.150065 -0.158216
O  2.445586 -2.975083 0.779763
O  0.983121 -2.617578 -1.650411
N  -0.238888 -2.182562 0.885413
C  1.981318 -0.353679 -0.265125
C  -1.289381 -1.360943 0.43364
C  2.817038 0.137754 0.751441
C  1.548273 0.415782 -1.357239
C  2.820376 2.311494 -0.418802
C  3.233801 1.483031 0.659715
C  1.977122 1.759704 -1.419809
C  -1.804532 -0.270118 1.197603
C  -1.902857 -1.645623 -0.819222
C  3.298921 3.747582 -0.516373
C  -2.908269 0.489855 0.751203
C  -2.973313 -0.866489 -1.286238
C  -3.491443 0.197621 -0.5073
H  0.068757 -2.008265 1.859095
H  3.148373 -0.512245 1.567709
H  0.919691 -0.026586 -2.136459
H  3.889682 1.89384 1.435608
H  1.653588 2.384877 -2.259591
H  -1.52458 -2.489383 -1.401976
H  2.571386 4.383156 -1.049609
H  3.47324 4.186472 0.481014
H  4.254878 3.804118 -1.07218
H  -3.429802 -1.099745 -2.251621
