program: Gaussian 09
title: 000288060
version: EM64L-G09RevD.01
frameworkgroup: C1[X(C18H14N2O6)]
method: RPBEPBE
basis: SDD
operation: Freq
keyword: #p
keyword: freq=noraman
keyword: PBEPBE/SDD
title: #p freq=noraman PBEPBE/SDD
converged: YES YES NO NO
title: Mulliken charges:
elementType: O O O O O O N N C C C C C C C C C C C C C C C C C C H H H H H H H H H H H H H H
charge: -0.181947 -0.223808 -0.287192 -0.161917 -0.377425 -0.192743 -0.253093 -0.195766 -0.560154 0.229047 0.262462 0.181360 0.220477 0.105921 0.100906 0.067980 0.359515 -0.470897 -0.353192 -0.361119 -0.626913 -0.759560 0.008356 -0.208742 -0.211324 0.097003 0.291342 0.314742 0.271283 0.270353 0.268824 0.296286 0.236435 0.234571 0.240622 0.236447 0.248967 0.239800 0.239726 0.403370
chargesum: 0.00000
title: Mulliken charges with hydrogens summed into heavy atoms:
elementType: O O O O O O N N C C C C C C C C C C C C C C C C C C
charge: -0.181947 -0.223808 -0.287192 -0.161917 0.025945 -0.192743 -0.253093 -0.195766 0.045930 0.229047 0.262462 0.181360 0.220477 0.105921 0.100906 0.067980 0.359515 -0.199614 -0.082839 -0.092296 0.140379 -0.033525 0.008356 0.031058 0.028402 0.097003
polarizability: 3.10752941e+02 2.61001473e+01 1.96804894e+02 1.88428307e+00 -1.26207628e+01 1.91074562e+02
1716.lowfreq: -7.4694 0.0006 0.0008 0.0008 2.6825 5.5399 18.8496 33.4021 41.1697
frequency: 18.6361 33.3663 41.1618 54.4968 66.9624 77.1003 91.5539 102.9200 116.3352 120.9677 143.8823 157.4548 165.5396 174.3771 202.3722 222.2019 240.8507 259.0742 269.4020 279.3571 304.8401 332.6165 338.2653 341.4337 370.7185 372.6762 405.9993 411.3376 455.1717 493.9193 497.5533 516.3625 521.8681 533.9802 570.7681 593.6324 600.6621 612.8067 635.6109 659.1934 673.8566 692.8789 699.0604 707.7741 728.5430 762.3233 783.8194 788.5343 794.5546 802.3790 849.5715 853.8384 906.4687 908.5382 934.9403 948.3202 974.0136 998.7049 1006.4336 1014.9661 1024.1770 1034.6854 1045.6688 1070.5729 1081.9405 1117.7880 1134.4814 1146.1736 1167.2428 1171.4927 1193.6884 1205.9758 1211.6833 1240.0528 1282.1391 1288.5403 1314.1544 1322.4892 1352.6843 1383.0926 1396.7246 1407.2167 1417.6540 1439.9986 1454.3789 1454.9351 1458.0357 1463.1103 1481.4934 1490.4508 1500.6113 1541.6215 1563.5054 1577.4188 1616.5104 1616.6014 1623.6197 1626.9580 1629.5598 1674.6677 2983.9279 2999.4852 3011.1081 3058.5578 3068.9335 3091.7293 3112.7036 3125.5171 3140.7518 3154.2986 3165.8483 3175.6507 3191.3048 3496.6338
redmass: 7.3815 5.4779 7.3052 8.1841 6.2288 8.4164 1.1608 3.4604 6.0036 6.3193 5.7649 4.4861 6.3781 7.8974 2.4643 1.6563 6.6880 6.8061 5.1700 4.6028 4.5425 3.3884 4.8096 3.8920 5.1210 5.4937 3.8386 3.5322 4.8455 5.3735 6.2208 4.9339 6.4827 3.7722 3.5488 3.9895 3.4877 4.2699 3.9282 4.8118 5.9736 6.1755 6.2307 3.3781 4.3721 7.4691 6.0624 5.2125 1.8048 3.5538 1.6106 5.2179 1.4075 5.3620 2.7847 4.3660 1.4155 2.7277 1.3506 1.8831 1.7734 4.3764 1.5260 2.5555 2.8759 1.3283 2.9941 2.8344 1.2550 2.0144 3.8866 3.0888 2.7311 1.8217 1.4707 1.5141 2.4126 5.0595 2.8368 1.6112 2.1545 1.3203 6.0757 1.5044 2.4649 2.7379 1.1114 1.0463 1.2120 1.1250 1.0519 6.4130 8.4940 12.1919 9.0033 7.7564 9.6012 10.0975 7.2934 12.0570 1.0388 1.0341 1.0606 1.0974 1.1003 1.1018 1.0974 1.1001 1.0865 1.0906 1.0956 1.1004 1.0924 1.0639
irintensity: 2.8373 2.0593 2.2093 0.6137 3.0778 0.4727 0.4851 2.8617 5.6474 2.0776 1.5710 2.5623 3.2305 4.0126 4.3047 1.9468 0.2991 4.9764 3.4022 3.0679 10.9365 5.0589 10.3732 3.5956 8.5006 2.0375 9.5386 6.9512 0.3386 2.2286 22.6477 24.4461 16.0654 10.8072 52.2619 12.8288 90.5710 58.7513 55.1801 0.2082 13.9152 36.7345 10.1711 68.7019 17.0229 8.9281 1.7859 0.2898 34.5625 5.6785 14.1224 6.0688 0.0824 73.7257 2.9342 47.9239 1.5488 25.4065 0.1123 2.0187 5.2066 120.3569 6.4454 42.7027 20.2704 0.4077 31.0321 11.1242 6.5156 3.7635 10.3859 19.8981 18.7637 36.5619 3.1038 25.9031 60.2057 200.3958 96.4762 9.1307 50.0057 8.3521 16.5466 114.8649 11.1750 2.4918 14.0229 7.2598 24.6302 48.1777 31.8096 34.4449 342.4274 80.1229 232.3919 1.0620 207.8621 218.3425 46.5203 58.8819 17.5266 47.3666 4.7085 11.3791 19.3765 18.2191 11.9131 1.5981 1.6285 5.5329 5.6171 21.7967 5.6769 54.6890
temp: 298.150 k
press: 1.00000 atm
elementType: 8 8 8 8 8 8 7 7 6 6 6 6 6 6 6 6 6 6 6 6 6 6 6 6 6 6 1 1 1 1 1 1 1 1 1 1 1 1 1 1
symmnumber: 1
zpe: 761047.4 jmol-1
zpe.correction: 0.289868 hartree
zpe.thermalcorrener: 0.313081 hartree
zpe.thermalcorrenthalpy: 0.314026 hartree
zpe.thermalcorrgfe: 0.236188 hartree
zpe.sumelectzpe: -1253.363961 hartree
zpe.sumelectthermal: -1253.340748 hartree
zpe.sumelectthermalent: -1253.339803 hartree
zpe.sumelectthermalfe: -1253.417641 hartree
dipole: 0.0137 -2.0996 2.9610
dipole: 3.6299
quadrupole: -95.2783 -153.4349 -161.9012
quadrupole: 0.9369 -5.2516 -6.9757
quadrupole: 41.5932 -16.5634 -25.0298 0.9369 -5.2516 -6.9757
hfenergy: -1253.6538291 hartree
pointgroup: C01 [X(C18H14N2O6)]
dipole: 0.3908301 -0.723951 1.1673093 debye
polarizability: 271.0827293|60.0248585|236.3276365|3.1394491|-13.5831883|191.2220314 unknown
InChI: InChI=1S/C18H14N2O6/c1-9-7-12(14(21)18(25)26)13(15(22)19(9)2)8-20-16(23)10-5-3-4-6-11(10)17(20)24/h3-7,25H,8H2,1-2H3
charge 0 multiplicity 1
40 atoms
O  1.083665 -1.872378 0.362994
O  1.416973 2.265504 -1.867769
O  -1.80294 -2.440022 -2.04514
O  -1.353934 1.66662 2.350744
O  -0.017897 3.245485 0.418255
O  -1.880969 2.731226 -0.884233
N  0.898977 0.179199 -0.838602
N  -3.018426 -2.431215 -0.033018
C  -0.401078 -0.069411 -1.498936
C  -1.482889 -0.564436 -0.549507
C  -1.908634 0.062843 0.627751
C  2.897949 -0.168243 0.31383
C  3.002121 1.068915 -0.366513
C  1.563518 -0.771426 0.001062
C  1.733613 1.30128 -1.124239
C  -2.077991 -1.846337 -0.949545
C  -3.391957 -1.821073 1.163403
C  -2.852504 -0.585933 1.493094
C  3.941252 -0.652845 1.115575
C  4.152723 1.864613 -0.268339
C  -3.579792 -3.745228 -0.423685
C  -4.380201 -2.529018 2.059127
C  -1.408683 1.390514 1.123159
C  5.111089 0.144283 1.221693
C  5.215418 1.383401 0.540291
C  -1.135606 2.501781 0.093498
H  -0.682738 0.870878 -2.004035
H  -0.279969 -0.847851 -2.274145
H  -3.138648 -0.098241 2.42615
H  3.849747 -1.610631 1.636996
H  4.223275 2.818638 -0.799799
H  -3.080303 -4.04265 -1.357504
H  -4.666697 -3.669899 -0.601955
H  -3.388076 -4.497123 0.359811
H  -3.985857 -3.497723 2.419365
H  -5.334687 -2.735869 1.540168
H  -4.597321 -1.903558 2.938489
H  5.947444 -0.200914 1.838787
H  6.130776 1.976096 0.6413
H  0.17516 3.898449 -0.310676
