program: Gaussian 09
title: 000288042
version: EM64L-G09RevD.01
frameworkgroup: C1[X(C20H18N2O)]
method: RPBEPBE
basis: SDD
operation: Freq
keyword: #p
keyword: freq=noraman
keyword: PBEPBE/SDD
title: #p freq=noraman PBEPBE/SDD
converged: YES YES NO NO
title: Mulliken charges:
elementType: O N N C C C C C C C C C C C C C C C C C C C C H H H H H H H H H H H H H H H H H H
charge: -0.290746 -0.238927 -0.025700 -0.017036 -0.488468 0.015567 -0.361504 0.204035 0.263285 0.157425 0.205938 0.362590 -0.686873 0.198411 -0.362344 -0.385366 -0.853931 -0.039341 -0.237302 -0.317573 -0.254605 -0.406745 -0.777224 0.258591 0.259158 0.250264 0.229781 0.217855 0.254351 0.282273 0.235055 0.243163 0.236801 0.239020 0.224298 0.225351 0.224829 0.234988 0.228322 0.264868 0.227463
chargesum: 0.00000
title: Mulliken charges with hydrogens summed into heavy atoms:
elementType: O N N C C C C C C C C C C C C C C C C C C C C
charge: -0.290746 -0.238927 -0.025700 0.241555 0.020954 0.015567 0.086132 0.204035 0.263285 0.157425 0.205938 0.362590 -0.432522 0.198411 -0.080070 -0.150310 -0.134947 -0.039341 -0.011951 -0.093275 -0.029775 -0.171758 -0.056572
polarizability: 3.78673072e+02 -3.65371749e+01 2.81403595e+02 -6.87423139e+00 -6.31309866e+00 1.10007471e+02
1716.lowfreq: -8.3087 -0.6889 -0.0002 0.0005 0.0006 3.6567 31.9289 59.4384 66.5759
frequency: 31.8792 59.4279 66.5700 71.3571 87.0333 107.0602 139.8763 159.1148 160.7198 174.1283 192.8463 208.1055 236.0246 250.9843 287.6459 319.0065 333.9452 344.0588 353.9637 377.8185 419.0122 438.2859 448.4159 491.2762 496.5521 538.3681 545.1475 551.7092 572.5386 589.7280 602.0856 617.1849 644.4024 688.8096 709.6988 725.8594 733.6797 756.2629 775.3018 792.1866 807.3485 828.3323 831.2352 855.2670 870.6522 876.2205 900.8579 903.0479 917.2150 946.0128 957.0357 966.7403 980.7417 990.2651 1020.7502 1031.1774 1033.7985 1041.7766 1047.0654 1074.0447 1086.4889 1102.3824 1115.2112 1130.9662 1135.9777 1140.7945 1173.5497 1204.1864 1231.7247 1235.5075 1247.9968 1257.4303 1289.0402 1309.3039 1322.5578 1331.6514 1339.2574 1364.3058 1387.8051 1394.2272 1395.8719 1400.2775 1407.1927 1427.9825 1433.6088 1458.4726 1462.9830 1467.4927 1472.6185 1474.3798 1479.8826 1480.5675 1482.1185 1506.8950 1567.4533 1583.0215 1597.1921 1614.8089 1636.9248 2972.5711 2977.1959 2994.0972 3052.9609 3061.3180 3065.0987 3083.6585 3098.1233 3105.3747 3118.8207 3128.3172 3130.9953 3138.0713 3153.7599 3157.0981 3164.4465 3165.9950 3172.6591
redmass: 4.5810 4.6694 4.9171 3.5589 4.2365 3.4881 2.8964 1.4351 1.2709 3.1122 4.0860 3.7261 3.5238 3.4251 3.6105 4.5432 3.4256 4.4773 3.2032 4.3231 3.9784 2.3043 3.0623 4.4925 3.6995 5.7606 4.8128 3.4448 4.0024 5.4142 4.0507 5.6961 4.5989 5.8676 4.9943 4.7431 4.5319 1.6936 2.6406 2.8047 2.6553 2.2659 2.2790 4.8961 1.4042 2.4526 1.7307 3.6618 2.5810 1.3916 1.3887 1.5898 1.3065 1.8435 1.9696 1.4837 1.4912 1.5913 3.7266 2.3746 1.6158 1.7869 1.4678 1.8887 1.7535 2.7171 1.1794 1.8488 1.6445 1.6858 2.6222 1.8810 1.7019 1.8142 2.5225 3.7349 1.5586 3.4289 1.3196 2.2301 1.4911 2.1069 4.0681 2.7588 3.0918 1.4927 1.4390 1.7690 1.0656 2.1762 2.4426 1.2539 1.4380 1.0794 7.3123 6.8425 7.3338 7.5574 7.7519 1.0447 1.0386 1.0682 1.0972 1.0899 1.0536 1.0933 1.0952 1.0925 1.0973 1.0855 1.0878 1.0903 1.0948 1.0915 1.0958 1.1002 1.1181
irintensity: 0.1558 2.1685 2.3999 6.1893 0.1634 3.1124 0.3888 0.6117 1.2663 0.3373 0.2044 0.6002 0.8969 0.5297 7.7029 0.8106 5.6094 0.9530 0.8523 6.2736 2.3899 13.1087 4.8544 0.7299 1.9632 9.6636 0.3553 0.3871 2.5119 3.8575 1.9261 4.1890 0.2040 11.9887 8.9790 5.7265 2.4907 62.0933 28.1816 0.1871 23.5172 32.6376 22.2907 1.3155 0.9932 8.2949 22.4113 2.2598 5.3204 2.8859 0.0507 15.4911 0.5972 1.3245 12.5790 9.3067 3.7798 3.8406 6.7845 4.3344 3.3119 4.7900 9.1035 10.9639 4.6800 13.0462 2.6990 58.7596 2.4011 30.2326 3.2746 13.7966 20.9124 43.1804 13.8643 24.4040 67.8813 49.2649 6.3612 17.5069 23.1987 8.1995 9.8257 82.2876 6.3698 94.4452 22.4319 29.9791 16.5930 3.0965 65.1241 9.7025 29.8314 14.0686 15.9687 2.1483 3.9523 70.6345 18.2835 39.2981 17.8625 31.5463 19.6377 18.7561 32.0708 7.4008 16.5097 9.7968 12.8930 0.0773 13.6901 15.1312 5.6480 5.8913 43.2925 30.1881 24.2403
temp: 298.150 k
press: 1.00000 atm
elementType: 8 7 7 6 6 6 6 6 6 6 6 6 6 6 6 6 6 6 6 6 6 6 6 1 1 1 1 1 1 1 1 1 1 1 1 1 1 1 1 1 1
symmnumber: 1
zpe: 860523.7 jmol-1
zpe.correction: 0.327756 hartree
zpe.thermalcorrener: 0.346950 hartree
zpe.thermalcorrenthalpy: 0.347894 hartree
zpe.thermalcorrgfe: 0.280430 hartree
zpe.sumelectzpe: -956.034495 hartree
zpe.sumelectthermal: -956.015301 hartree
zpe.sumelectthermalent: -956.014357 hartree
zpe.sumelectthermalfe: -956.081822 hartree
dipole: -3.4397 -2.8670 1.1939
dipole: 4.6343
quadrupole: -153.0450 -109.1600 -138.8268
quadrupole: 10.3435 -5.8231 -2.2976
quadrupole: -19.3678 24.5172 -5.1495 10.3435 -5.8231 -2.2976
hfenergy: -956.3622515 hartree
pointgroup: C01 [X(C20H18N2O1)]
dipole: 1.2378914 -1.238025 -0.5092037 debye
polarizability: 385.4967831|24.7907182|273.0638259|4.1897948|18.0787851|111.5235292 unknown
InChI: InChI=1S/C20H18N2O/c1-12-15-7-8-21-13(2)17(15)9-18-16-5-3-4-6-19(16)22(20(12)18)10-14-11-23-14/h3-9,14H,10-11H2,1-2H3
charge 0 multiplicity 1
41 atoms
O  4.39262 -2.060062 0.627635
N  1.453049 -0.57459 -0.18155
N  -5.0538 0.123434 -0.091581
C  2.968834 -2.505513 0.361086
C  2.212092 -1.720019 -0.701784
C  0.041471 -0.420823 -0.116203
C  4.112703 -3.390675 -0.026793
C  2.061684 0.694758 -0.000502
C  -0.237767 0.996489 0.066486
C  1.043811 1.687699 0.151592
C  -0.988292 -1.381434 -0.159392
C  -2.344137 -0.883138 -0.141818
C  -1.549925 1.461673 0.133092
C  -2.629786 0.539407 0.001759
C  3.433862 1.019124 0.028874
C  1.405718 3.041335 0.33023
C  -0.739493 -2.883345 -0.159591
C  -4.013228 0.97795 0.024525
C  3.77332 2.380238 0.20316
C  -3.482982 -1.752401 -0.264959
C  2.775826 3.382489 0.351509
C  -4.771147 -1.223796 -0.237934
C  -4.367909 2.444075 0.178521
H  2.414791 -2.730313 1.281872
H  1.523154 -2.390459 -1.239514
H  2.947514 -1.349829 -1.443202
H  4.35031 -4.267857 0.586121
H  4.409837 -3.45208 -1.082206
H  -1.751978 2.526811 0.278015
H  4.207605 0.248238 -0.039227
H  0.639391 3.815296 0.449669
H  -1.52249 -3.404734 0.416256
H  -0.742772 -3.320555 -1.177879
H  0.219359 -3.139356 0.318756
H  -3.357129 -2.829946 -0.400961
H  4.830836 2.66531 0.238444
H  3.075999 4.426438 0.491102
H  -5.647077 -1.874228 -0.339268
H  -3.947113 3.055079 -0.642476
H  -5.463755 2.541479 0.165893
H  -3.985604 2.860232 1.130046
