program: Gaussian 09
title: 000288008
version: EM64L-G09RevD.01
frameworkgroup: C1[X(C10H12N2O6)]
method: RPBEPBE
basis: SDD
operation: Freq
keyword: #p
keyword: freq=noraman
keyword: PBEPBE/SDD
title: #p freq=noraman PBEPBE/SDD
converged: NO YES NO NO
title: Mulliken charges:
elementType: O O O O O O N N C C C C C C C C C C H H H H H H H H H H H H
charge: -0.256236 -0.463910 -0.437589 -0.248945 -0.236234 -0.220735 -0.169790 -0.409606 -0.118501 -0.050099 -0.507706 -0.079616 -0.382341 -0.139914 0.232658 0.134939 0.108881 -0.187769 0.266755 0.277913 0.254159 0.281686 0.247454 0.233712 0.225422 0.357271 0.359762 0.366086 0.349169 0.213122
chargesum: 0.00000
title: Mulliken charges with hydrogens summed into heavy atoms:
elementType: O O O O O O N N C C C C C C C C C C
charge: -0.256236 -0.106639 -0.088419 -0.248945 -0.236234 -0.220735 -0.169790 -0.043520 0.148254 0.227814 0.028139 0.167838 0.076793 0.219848 0.232658 0.134939 0.108881 0.025353
polarizability: 1.83981474e+02 -7.75205905e+00 1.60149530e+02 5.05893734e+00 -6.68477646e+00 8.42359632e+01
1716.lowfreq: -7.9454 -0.0006 -0.0005 0.0004 2.2402 5.4707 29.2966 34.2917 58.2314
frequency: 29.2811 34.2522 58.2308 81.4797 100.6918 117.7385 151.1162 167.3344 174.8800 204.5944 207.8391 233.1925 253.5574 271.9393 283.0777 333.2828 338.7773 385.9259 395.8738 419.2818 437.8062 479.3485 492.7578 515.9051 572.6821 643.3562 673.6921 707.6705 717.8930 722.0312 741.4217 760.8074 790.3268 820.7937 846.8534 876.6851 901.9993 941.3594 958.5339 976.8750 987.5342 1002.7190 1023.6513 1047.4569 1053.7771 1069.3715 1091.8874 1114.0727 1140.4020 1155.4691 1188.3742 1221.4794 1248.6924 1267.8266 1287.4440 1295.3792 1315.2689 1320.6109 1331.5372 1333.7872 1345.5002 1362.5548 1368.5946 1376.4431 1405.7013 1446.1845 1455.9226 1469.0462 1569.5036 1618.0012 1645.9916 1666.8136 2955.6448 3005.3873 3018.2583 3030.0625 3046.8896 3079.1802 3083.4602 3086.9486 3115.4981 3517.0652 3578.5412 3580.6283
redmass: 5.7612 7.4172 8.2336 7.8927 5.9891 4.5697 4.9898 6.8264 3.8948 4.0376 6.0753 5.8091 1.8215 2.0701 2.5463 1.1992 10.8092 3.1577 3.7986 5.9408 4.2415 3.4753 4.5856 7.9218 7.7833 5.6631 4.2147 2.9878 4.3860 4.7478 5.7807 5.3461 2.3524 3.1269 2.5591 3.6861 3.6089 2.8573 3.6696 1.5261 4.2251 2.9334 1.5074 2.2389 2.2010 2.4842 2.6148 4.3775 1.3579 1.2477 1.3937 5.0349 1.3445 1.3606 2.3850 1.3168 1.4007 1.3064 1.9047 1.6115 1.5243 1.2344 1.6729 1.4149 1.6968 1.7010 1.2064 1.0821 5.8119 5.4282 11.6636 6.0439 1.0875 1.0611 1.0869 1.0820 1.0684 1.0882 1.1038 1.0973 1.1029 1.0769 1.0668 1.0665
irintensity: 0.2663 0.8846 0.2682 5.4088 2.5276 2.6333 7.4775 8.7108 2.9871 23.2481 19.6990 0.9995 62.7803 97.8313 19.4723 134.5735 13.6282 8.0181 15.6452 15.6463 14.8462 2.3991 30.3480 39.9738 23.6879 7.7514 5.8900 13.9369 1.3784 8.7403 5.7795 5.7137 120.5235 19.9670 42.4002 35.1476 24.6297 40.7660 39.0258 2.9270 197.3747 47.7600 19.2180 80.9630 55.1956 2.6098 59.1853 38.0033 18.2267 22.1694 9.8088 25.4504 21.3857 10.9868 150.6549 8.0750 3.4709 4.5095 133.9976 162.2197 25.0013 6.3987 31.6358 2.3325 16.4865 61.0703 22.9603 8.6464 279.8823 121.6744 242.1355 760.5314 55.0734 30.8766 20.4503 15.7309 15.2581 2.7432 30.2021 103.4250 8.4055 62.5489 12.8295 14.1294
temp: 298.150 k
press: 1.00000 atm
elementType: 8 8 8 8 8 8 7 7 6 6 6 6 6 6 6 6 6 6 1 1 1 1 1 1 1 1 1 1 1 1
symmnumber: 1
zpe: 587041.7 jmol-1
zpe.correction: 0.223592 hartree
zpe.thermalcorrener: 0.240570 hartree
zpe.thermalcorrenthalpy: 0.241514 hartree
zpe.thermalcorrgfe: 0.177925 hartree
zpe.sumelectzpe: -947.755962 hartree
zpe.sumelectthermal: -947.738984 hartree
zpe.sumelectthermalent: -947.738040 hartree
zpe.sumelectthermalfe: -947.801630 hartree
dipole: 6.1367 -0.4538 0.1699
dipole: 6.1558
quadrupole: -111.0695 -117.6911 -100.6789
quadrupole: 11.3347 -7.6793 -3.5618
quadrupole: -1.2563 -7.8779 9.1342 11.3347 -7.6793 -3.5618
hfenergy: -947.9795545 hartree
pointgroup: C01 [X(C10H12N2O6)]
dipole: 2.4048067 -0.014399 -0.286771 debye
polarizability: 183.7490661|-2.8952315|140.8297593|-10.6878533|33.4630785|103.7881414 unknown
InChI: InChI=1S/C10H12N2O6/c13-3-5-2-12(10(17)11-9(5)16)8-1-6(15)7(4-14)18-8/h2-3,6-8,11,14-15H,1,4H2
charge 0 multiplicity 1
30 atoms
O  1.598159 0.111757 -1.258016
O  1.87137 1.119798 1.728715
O  5.232935 0.951446 -0.712384
O  -0.913102 -2.731532 -1.446668
O  -4.4186 -0.107926 0.174521
O  -1.723927 2.653911 1.918527
N  -0.361422 -0.797759 -0.198907
N  -2.625928 -1.382931 -0.602507
C  2.714581 0.248863 0.891281
C  1.08968 -1.021337 -0.460948
C  1.986009 -1.108885 0.80229
C  2.771525 0.72313 -0.578858
C  4.063245 0.279876 -1.298398
C  -0.796695 0.312491 0.494707
C  -1.283338 -1.716135 -0.801897
C  -2.136759 0.617845 0.670139
C  -3.167846 -0.260344 0.099961
C  -2.539601 1.828103 1.416877
H  3.730468 0.166786 1.319341
H  1.122756 -1.934336 -1.075954
H  2.71512 -1.925969 0.675138
H  1.411052 -1.300124 1.721294
H  2.645765 1.819615 -0.660851
H  3.966114 0.47319 -2.384013
H  4.243329 -0.798931 -1.152506
H  2.308553 1.995911 1.872121
H  -0.017361 0.952088 0.932918
H  -3.306225 -2.026523 -1.021178
H  5.321624 1.859778 -1.095048
H  -3.64068 1.96734 1.505502
