program: Gaussian 09
title: 000288051
version: EM64L-G09RevD.01
frameworkgroup: C1[X(C15H19N5O4S)]
method: RPBEPBE
basis: SDD
operation: Freq
keyword: #p
keyword: freq=noraman
keyword: PBEPBE/SDD
title: #p freq=noraman PBEPBE/SDD
converged: YES YES NO NO
title: Mulliken charges:
elementType: S O O O O N N N N N C C C C C C C C C C C C C C C H H H H H H H H H H H H H H H H H H H
charge: 0.251737 -0.271511 -0.269485 -0.216820 -0.177098 -0.171326 -0.081434 -0.043506 -0.061397 -0.610690 -0.156714 -0.173242 -0.119909 -0.111009 0.328177 -0.686221 -0.693979 -0.192333 0.170694 -0.201176 -0.105000 0.157741 -0.596301 -0.364143 -0.625646 0.264536 0.293321 0.307274 0.294286 0.221169 0.224476 0.274534 0.221908 0.242308 0.223107 0.288201 0.255953 0.285160 0.245358 0.251792 0.227015 0.222587 0.343503 0.334099
chargesum: 0.00000
title: Mulliken charges with hydrogens summed into heavy atoms:
elementType: S O O O O N N N N N C C C C C C C C C C C C C C C
charge: 0.251737 -0.271511 -0.269485 -0.216820 -0.177098 -0.171326 -0.081434 -0.043506 -0.061397 0.066912 0.107822 0.120079 0.187365 0.183277 0.328177 0.033959 -0.006656 -0.192333 0.170694 0.087025 -0.105000 0.157741 -0.055188 -0.118785 0.075749
polarizability: 2.87301511e+02 1.00431775e+01 2.12201823e+02 1.56706628e+00 -2.65587537e+01 1.77469747e+02
1716.lowfreq: -7.6092 -4.5553 0.0011 0.0012 0.0014 5.8222 16.6576 30.2614 33.4070
frequency: 16.6508 30.2379 33.4004 46.9571 48.1544 62.1666 81.4461 86.3931 108.2790 128.8916 154.5201 161.2370 165.9991 191.7229 206.9641 213.6225 237.6070 244.1214 257.3746 272.3630 282.1671 287.8588 330.0902 338.1264 354.4459 390.4377 413.1164 420.8501 464.2316 490.0758 509.1582 514.8792 544.2787 546.4585 548.8576 562.5207 595.3003 603.7197 616.9846 645.7201 648.5159 671.9732 694.9834 706.3641 713.7115 729.1023 758.1051 761.4418 783.1016 791.6775 823.4186 843.1167 848.7474 859.7107 875.4958 912.9706 924.1519 931.6359 950.4626 959.7573 982.2793 986.6872 1000.4015 1005.2763 1013.0157 1035.6016 1038.5826 1057.6933 1064.2609 1071.4633 1125.1583 1139.7860 1184.0975 1194.2658 1202.5988 1209.7698 1226.8748 1249.8178 1254.0457 1254.7451 1261.0106 1272.9452 1282.1804 1294.7525 1301.5760 1313.7045 1326.6487 1334.9954 1356.8595 1382.2254 1383.6434 1386.9886 1394.7987 1395.0037 1427.9447 1432.1089 1452.4767 1456.1664 1460.7462 1467.7555 1473.1714 1480.3054 1482.1212 1545.3861 1578.9799 1586.7904 1632.6604 2986.3150 2994.4525 3008.3731 3037.5655 3038.1273 3060.2956 3079.2819 3081.5725 3093.7771 3096.0244 3096.4385 3102.5950 3110.8758 3121.0635 3122.3637 3168.5269 3226.5452 3540.3728 3695.5347
redmass: 6.3683 4.1462 5.4048 4.8558 5.6225 3.7569 3.9859 6.7251 5.2626 4.0172 2.9105 1.4890 3.6064 3.5421 2.4494 3.2151 4.4891 1.0903 4.1446 1.8318 4.4889 4.8652 3.6279 4.2837 2.9274 2.7181 6.5235 8.6138 5.1589 4.8131 8.6503 1.2286 4.6488 1.0719 7.2003 4.2856 6.7056 5.2622 5.0061 5.9689 5.8287 8.5461 7.6337 5.3860 8.3574 7.5236 1.2060 4.5672 6.0474 3.7152 1.8307 6.6684 7.8485 2.9722 5.6030 3.9351 1.5569 1.4340 2.1058 2.4747 1.7886 1.3269 4.2001 5.1251 5.0236 4.1075 3.0967 2.0522 1.8083 2.0764 3.8428 1.9660 2.1739 1.7755 2.0487 2.2355 2.1033 1.8599 1.2211 1.6848 3.1126 1.4838 1.2213 1.5102 4.9867 4.5034 1.2789 1.2526 2.3889 1.2889 3.1139 1.3967 1.2035 1.2210 2.9513 1.1069 1.0504 1.0507 3.7486 1.0412 1.0674 1.0460 1.0481 8.1419 1.8786 10.3671 2.7364 1.0368 1.0353 1.0357 1.0595 1.0839 1.0875 1.0963 1.0881 1.1020 1.0909 1.0969 1.1012 1.0995 1.1062 1.1010 1.0922 1.0985 1.0443 1.1056
irintensity: 0.1940 0.3416 0.4767 1.0806 1.0775 0.5899 1.4560 0.8857 0.3929 0.4692 1.6723 0.3949 3.0130 1.9986 4.2775 11.4906 2.3982 1.0516 9.2606 8.2643 11.6675 4.2158 2.4279 1.3019 1.2304 4.6454 0.2981 11.3830 8.0266 9.9185 3.6020 253.1494 4.1744 0.0836 0.0522 0.3531 5.1748 5.2031 6.5393 3.6193 67.5190 0.3214 20.1027 28.7170 13.7155 11.9345 3.6834 90.9837 162.6353 15.9579 10.2883 3.8293 7.7487 9.9944 44.0965 46.9384 1.0602 12.3304 5.3586 3.4358 52.4382 5.5461 220.4651 23.1874 9.3363 21.3588 99.2990 7.3299 5.7247 4.7284 27.2540 26.6327 89.0260 45.1460 73.9720 12.9584 111.1886 27.3219 1.6298 9.6521 75.3542 13.8983 13.0630 22.1741 58.1256 27.3296 5.8696 3.6997 77.8630 34.0547 16.4093 9.3392 17.5759 37.3133 69.7227 18.6627 4.9752 2.7390 23.5110 17.9641 0.3196 8.8105 12.6409 79.8293 31.9391 134.1244 595.4862 31.8459 14.7060 15.0017 10.1598 7.2681 16.9133 26.7564 9.7259 6.9376 7.1547 4.8681 7.4681 21.8958 13.4986 18.1259 16.4266 0.1305 125.7587 48.7950
temp: 298.150 k
press: 1.00000 atm
elementType: 16 8 8 8 8 7 7 7 7 7 6 6 6 6 6 6 6 6 6 6 6 6 6 6 6 1 1 1 1 1 1 1 1 1 1 1 1 1 1 1 1 1 1 1
symmnumber: 1
zpe: 888324.7 jmol-1
zpe.correction: 0.338345 hartree
zpe.thermalcorrener: 0.362210 hartree
zpe.thermalcorrenthalpy: 0.363154 hartree
zpe.thermalcorrgfe: 0.283134 hartree
zpe.sumelectzpe: -1553.845116 hartree
zpe.sumelectthermal: -1553.821251 hartree
zpe.sumelectthermalent: -1553.820307 hartree
zpe.sumelectthermalfe: -1553.900327 hartree
dipole: -0.1424 1.8026 -1.1808
dipole: 2.1596
quadrupole: -136.3941 -151.3930 -157.8527
quadrupole: 12.3913 -11.7865 4.5658
quadrupole: 12.1525 -2.8464 -9.3061 12.3913 -11.7865 4.5658
hfenergy: -1554.1834612 hartree
pointgroup: C01 [X(C15H19N5O4S1)]
dipole: 0.5653386 -0.4430623 -0.4538684 debye
polarizability: 228.0443357|31.8995622|270.4461617|-28.5187791|3.2769113|178.4825836 unknown
InChI: InChI=1S/C15H19N5O4S/c1-4-25-14(21)10-8-9(24-15(2,3)23-8)13(22-10)20-6-19-7-11(16)17-5-18-12(7)20/h5-6,8-10,13H,4,16H2,1-3H3
charge 0 multiplicity 1
44 atoms
S  2.125912 -1.853917 1.075204
O  0.178444 3.389821 -0.911306
O  2.495288 3.007854 -1.095646
O  0.957237 0.885289 0.960813
O  3.104872 -0.952829 -1.324922
N  -0.88154 -0.110744 -0.32518
N  -1.376364 -2.082796 -1.400773
N  -2.680982 -0.131494 1.390697
N  -4.115012 -2.122981 1.203425
N  -3.785781 -3.796467 -0.432609
C  0.327816 1.948911 -1.117667
C  1.87305 1.683948 -1.151094
C  -0.213747 1.128052 0.08369
C  2.15694 0.809236 0.102695
C  1.505852 3.983907 -0.560013
C  1.638914 4.142349 0.961313
C  1.662106 5.285005 -1.339905
C  2.535955 -0.647515 -0.248283
C  -1.995696 -0.654071 0.33688
C  -0.556889 -1.020422 -1.355581
C  -2.283724 -1.864741 -0.344168
C  -3.400033 -2.612194 0.134666
C  2.892851 -3.39892 0.272249
C  -3.726137 -0.933676 1.758447
C  4.402614 -3.500677 0.524772
H  -0.196618 1.697552 -2.053901
H  2.239517 1.195707 -2.067285
H  -0.933863 1.694578 0.694353
H  2.992542 1.243536 0.681278
H  2.644072 4.525547 1.209548
H  0.887406 4.864223 1.325092
H  1.478372 3.182512 1.480002
H  2.654755 5.725588 -1.146122
H  1.559906 5.08911 -2.418846
H  0.887156 6.005803 -1.02929
H  0.277507 -0.86438 -2.036414
H  2.329407 -4.238164 0.71187
H  2.666475 -3.328166 -0.804309
H  -4.328887 -0.584551 2.601844
H  4.93351 -2.64505 0.074119
H  4.633577 -3.530576 1.603739
H  4.796965 -4.425939 0.063049
H  -3.270887 -4.171893 -1.226052
H  -4.593359 -4.285161 -0.051678
