program: Gaussian 09
title: 000288013
version: EM64L-G09RevD.01
frameworkgroup: C1[X(C16H17ClFNO2S)]
method: RPBEPBE
basis: SDD
operation: Freq
keyword: #p
keyword: freq=noraman
keyword: PBEPBE/SDD
title: #p freq=noraman PBEPBE/SDD
converged: YES YES NO NO
title: Mulliken charges:
elementType: Cl S F O O N C C C C C C C C C C C C C C C C H H H H H H H H H H H H H H H H H
charge: -0.082242 1.078874 -0.347374 -0.480429 -0.480821 -0.699484 -0.372347 -0.360615 -0.574151 -0.576375 0.534930 0.633711 -0.378811 -0.407446 -0.099942 -0.315310 -0.405464 -0.197693 -0.247886 -0.435382 -0.439328 0.516782 0.209561 0.219941 0.225941 0.206232 0.215383 0.225645 0.210905 0.231965 0.292085 0.247574 0.231906 0.245727 0.289789 0.246291 0.219211 0.308557 0.310092
chargesum: 0.00000
title: Mulliken charges with hydrogens summed into heavy atoms:
elementType: Cl S F O O N C C C C C C C C C C C C C C C C
charge: -0.082242 1.078874 -0.347374 -0.480429 -0.480821 -0.080835 0.057154 0.071558 -0.133123 -0.133505 0.534930 0.633711 -0.086726 -0.159872 -0.099942 -0.315310 -0.173558 0.048034 0.041903 -0.189091 -0.220117 0.516782
polarizability: 3.24298587e+02 -1.41499535e+01 2.27260964e+02 -2.96923159e+01 -1.04499101e+01 1.30528507e+02
1716.lowfreq: -6.6489 -5.8744 -0.0016 -0.0013 0.0012 2.7254 8.7244 12.3904 21.7271
frequency: 7.5490 12.3622 21.6729 29.6135 35.5435 60.5934 94.1528 95.8716 112.8124 125.6084 138.1866 178.8356 186.6664 207.2504 220.5075 230.5100 242.5593 266.7666 288.7460 303.8420 314.4048 334.6097 353.9784 362.0606 384.9101 397.7361 407.7711 431.4491 442.1952 447.1213 452.8789 508.4606 529.6106 557.6940 588.5094 602.9003 655.6629 676.9521 690.8622 712.5631 735.7970 778.4064 779.4723 798.6506 815.9752 826.4653 848.2218 860.2864 878.3638 897.7195 905.8970 929.5720 942.3820 977.5968 992.8126 994.1952 1000.1981 1016.5427 1026.9237 1041.0155 1047.0579 1059.7664 1064.0238 1085.0643 1114.7089 1158.4615 1178.4808 1210.6700 1217.1372 1230.2613 1233.8153 1266.2503 1283.3650 1292.1307 1294.4241 1302.5826 1320.2927 1333.0091 1346.0102 1378.0548 1383.3819 1424.2560 1427.0392 1464.2420 1464.4601 1468.5323 1476.6680 1488.1704 1508.5466 1563.0428 1563.6813 1610.0100 1633.3469 1645.1247 2966.7324 2974.1190 2983.3573 2988.0663 3010.0994 3027.4725 3046.2834 3059.1464 3117.4724 3134.1492 3141.2507 3149.0763 3153.0158 3157.8103 3175.8269 3569.5418 3709.3879
redmass: 7.7055 7.6801 11.7759 6.2500 5.0487 5.3435 3.7071 4.2367 2.4118 4.1692 4.0351 5.1104 5.2590 6.2824 8.1525 5.8146 7.9072 4.4474 3.3310 4.2996 10.8436 3.9507 1.1406 1.1345 4.6092 4.0935 4.6055 8.8569 4.0301 3.0350 3.0089 5.8182 5.7568 10.1056 4.8157 3.8009 6.6118 7.2356 2.3869 3.2198 1.0815 2.1314 1.5537 1.4360 1.5857 4.5682 1.6845 12.0349 4.3563 1.4955 1.5146 1.3401 1.3832 5.4032 2.9368 2.3665 3.7413 2.6102 1.6175 4.9118 1.7881 2.5457 2.0227 1.4569 1.2262 1.2079 1.1046 2.1328 1.8261 1.2712 1.4396 1.4283 1.1465 1.1976 1.3291 1.3615 2.4436 1.4050 1.5112 4.3273 5.6834 2.5915 3.6890 1.2504 1.1176 1.8838 1.1040 1.1031 3.7372 6.2094 6.8578 6.9777 2.4037 1.7035 1.0589 1.0597 1.0604 1.0595 1.0976 1.1009 1.1043 1.1047 1.0869 1.0891 1.0965 1.0926 1.0925 1.0914 1.0988 1.0450 1.1041
irintensity: 0.3839 0.2763 0.1768 1.8311 0.9920 0.3835 0.3582 1.2502 0.4819 1.5774 2.5136 4.4706 0.4028 6.8961 1.6557 0.5312 3.3417 5.1208 2.3265 4.1680 3.6073 1.5316 147.2738 159.2000 9.3604 0.9018 4.3140 50.8628 37.3628 4.7278 2.0317 8.3057 43.5877 96.9446 16.5607 1.9600 3.6545 7.9296 35.4026 0.4095 5.3621 20.2514 2.0946 22.2984 27.1163 21.3112 45.1316 76.8531 29.7671 6.5629 9.7775 1.0212 0.0868 3.9379 42.2758 35.3019 7.8582 27.7249 2.2145 4.9961 12.9388 0.0627 3.7026 2.2140 11.8317 9.3562 0.5842 0.0980 7.6317 21.2680 1.1684 5.6354 0.5957 5.5057 0.6094 9.9220 35.9375 3.5715 2.3875 22.3440 12.4930 6.9167 3.2598 4.0723 4.4982 29.9625 3.1922 18.9073 139.6639 6.3464 32.0813 25.5578 21.9305 364.9397 6.3069 5.0549 28.5484 72.1187 2.6540 0.4357 0.1843 65.7284 15.6523 8.6213 22.9738 3.4917 6.9854 8.6227 8.4255 89.3219 22.4110
temp: 298.150 k
press: 1.00000 atm
elementType: 17 16 9 8 8 7 6 6 6 6 6 6 6 6 6 6 6 6 6 6 6 6 1 1 1 1 1 1 1 1 1 1 1 1 1 1 1 1 1
symmnumber: 1
zpe: 775523.2 jmol-1
zpe.correction: 0.295381 hartree
zpe.thermalcorrener: 0.318086 hartree
zpe.thermalcorrenthalpy: 0.319031 hartree
zpe.thermalcorrgfe: 0.238287 hartree
zpe.sumelectzpe: -1781.295840 hartree
zpe.sumelectthermal: -1781.273135 hartree
zpe.sumelectthermalent: -1781.272190 hartree
zpe.sumelectthermalfe: -1781.352934 hartree
dipole: -8.6253 6.8800 0.6630
dipole: 11.0530
quadrupole: -136.2979 -138.6831 -151.2946
quadrupole: 20.9094 -7.9675 -3.6391
quadrupole: 5.7940 3.4088 -9.2028 20.9094 -7.9675 -3.6391
hfenergy: -1781.5912211 hartree
pointgroup: C01 [X(C16H17Cl1F1N1O2S1)]
dipole: 3.3606145 -2.7385351 0.3420843 debye
polarizability: 322.6904036|-15.165702|227.6271516|33.8508327|9.4468059|131.7705025 unknown
InChI: InChI=1S/C16H17ClFNO2S/c17-16-11-14(19)9-8-13(16)6-2-1-4-12-5-3-7-15(10-12)22(18,20)21/h3,5,7-11H,1-2,4,6,19H2
charge 0 multiplicity 1
39 atoms
Cl 3.3013 2.546463 0.103864
S  -5.553738 1.446304 -0.402666
F  -6.267032 1.60306 1.308455
O  -4.617889 2.737058 -0.602635
O  -6.799805 1.133026 -1.367528
N  7.953196 0.275956 0.715233
C  -0.006618 -0.706933 -0.210482
C  1.464447 -0.568466 0.235887
C  -0.968593 -0.943097 0.988655
C  2.421236 -0.310431 -0.96098
C  -2.417519 -1.07604 0.553111
C  3.86921 -0.136282 -0.538032
C  -3.209522 0.081578 0.337333
C  -3.004475 -2.346822 0.312117
C  -4.526952 -0.093495 -0.108227
C  4.395656 1.073124 -0.027059
C  4.793031 -1.214244 -0.607915
C  -4.337854 -2.479208 -0.138036
C  -5.135389 -1.333692 -0.357551
C  5.725426 1.240623 0.390848
C  6.13433 -1.098107 -0.199424
C  6.62534 0.139353 0.309417
H  -0.106015 -1.54461 -0.930622
H  -0.316869 0.209825 -0.751518
H  1.556732 0.26679 0.957063
H  1.786234 -1.48636 0.768321
H  -0.652657 -1.857788 1.526182
H  -0.860455 -0.099786 1.697712
H  2.347958 -1.158488 -1.669404
H  2.072353 0.592052 -1.498782
H  -2.802894 1.084489 0.507797
H  -2.403257 -3.247518 0.482892
H  4.437911 -2.174087 -1.002992
H  -4.763581 -3.472094 -0.314275
H  -6.169457 -1.401865 -0.708025
H  6.064089 2.209943 0.770438
H  6.807855 -1.959649 -0.278233
H  8.597532 -0.506393 0.653985
H  8.303333 1.16021 1.071081
