program: Gaussian 09
title: 000287981
version: EM64L-G09RevD.01
frameworkgroup: C1[X(C11H15N)]
method: RPBEPBE
basis: SDD
operation: Freq
keyword: #pfreq=noraman
keyword: PBEPBE/SDD
title: #p freq=noraman PBEPBE/SDD
converged: YES YES NO NO
title: Mulliken charges:
elementType: N C C C C C C C C C C C H H H H H H H H H H H H H H H
charge: -0.091748 -0.122045 -0.402044 -0.405811 -0.503942 -0.719746 0.440618 -0.435577 -0.377031 -0.220275 -0.225911 -0.245514 0.234564 0.221352 0.186088 0.192920 0.226047 0.185520 0.233300 0.214385 0.215828 0.232023 0.228861 0.267164 0.222604 0.222946 0.225425
chargesum: 0.00000
title: Mulliken charges with hydrogens summed into heavy atoms:
elementType: N C C C C C C C C C C C
charge: -0.091748 0.112519 0.005395 0.013156 -0.085122 -0.057510 0.440618 -0.206716 -0.109867 0.002330 -0.002965 -0.020089
polarizability: 1.54899334e+02 -4.29110121e+00 1.18966299e+02 -1.23527678e+01 -5.54393721e+00 8.34273946e+01
1716.lowfreq: -12.7971 -4.5576 -0.0004 0.0003 0.0007 15.1884 32.2903 57.8788 61.4791
frequency: 32.1453 57.8184 61.3879 124.6008 193.3786 233.7929 266.9186 284.2118 335.6990 362.8106 391.7971 405.9131 465.7918 582.9326 616.6135 693.8734 706.8920 747.7734 790.9516 807.3258 859.8230 869.5697 882.5422 899.7557 913.3614 945.5130 969.6980 982.7374 989.7395 1000.1932 1025.4287 1056.9176 1067.7186 1077.7556 1088.0290 1113.8249 1114.8123 1168.9636 1179.2682 1188.8766 1201.3150 1208.6217 1222.6473 1243.8444 1270.8690 1295.6342 1312.2194 1337.2697 1353.0673 1384.6459 1388.1319 1438.6225 1456.3320 1468.9613 1471.6025 1482.0215 1482.1391 1491.0769 1593.8579 1614.9851 2830.8371 2908.4335 2920.7670 2973.1082 2976.8358 3026.0811 3036.1576 3043.5020 3066.0261 3080.8569 3109.7386 3121.6491 3134.8609 3148.2046 3160.7374
redmass: 3.5003 3.3722 2.8252 3.0347 3.6201 1.1673 3.0886 2.2291 3.3653 2.0632 1.9521 2.8552 2.9021 4.8288 6.3354 4.0026 1.9637 1.6044 2.7840 3.3191 1.2562 2.2241 2.0569 1.3709 1.3477 1.7759 2.0275 1.3706 6.1660 1.3528 2.1760 2.0138 2.2656 1.5649 1.3463 1.2005 1.4314 1.0623 1.1114 2.7049 1.8278 1.3815 3.3183 1.4365 1.3163 1.4692 1.3823 1.6164 1.6280 1.4312 3.1478 2.0940 1.1221 1.0719 1.0453 1.0567 2.2397 1.1186 6.2022 6.1406 1.0706 1.0652 1.0681 1.0354 1.0855 1.0963 1.0953 1.0904 1.0992 1.0995 1.0869 1.0863 1.0920 1.0950 1.1011
irintensity: 0.1344 0.2064 1.2156 2.1342 1.4076 0.1429 0.7304 5.0115 1.3974 1.6739 0.8301 0.2498 11.6030 1.0123 0.1406 3.6237 41.1363 59.1048 13.7623 2.9947 0.4134 3.7697 1.6628 0.5252 4.0785 6.3257 14.5372 0.2203 0.0127 2.2157 13.1201 2.0910 1.8060 8.4131 1.4472 5.3074 2.9543 0.3160 1.9395 20.6537 2.2828 2.3051 22.9080 6.9004 7.7279 7.6672 3.4793 6.0077 12.1151 17.5756 6.1259 11.6649 11.9282 3.5069 8.1028 4.9538 14.1586 7.1572 0.8479 8.1585 82.8559 108.9988 81.4963 33.5382 25.8804 47.5507 23.3779 39.6985 42.8692 62.4882 9.5451 0.5449 26.4628 29.5667 25.4415
temp: 298.150 k
press: 1.00000 atm
elementType: 7 6 6 6 6 6 6 6 6 6 6 6 1 1 1 1 1 1 1 1 1 1 1 1 1 1 1
symmnumber: 1
zpe: 608975.9 jmol-1
zpe.correction: 0.231947 hartree
zpe.thermalcorrener: 0.243260 hartree
zpe.thermalcorrenthalpy: 0.244204 hartree
zpe.thermalcorrgfe: 0.193619 hartree
zpe.sumelectzpe: -481.975878 hartree
zpe.sumelectthermal: -481.964565 hartree
zpe.sumelectthermalent: -481.963620 hartree
zpe.sumelectthermalfe: -482.014205 hartree
dipole: 0.9655 -0.8228 0.6033
dipole: 1.4047
quadrupole: -67.1439 -68.0413 -74.9904
quadrupole: -1.5702 -1.1099 -1.0941
quadrupole: 2.9147 2.0172 -4.9319 -1.5702 -1.1099 -1.0941
hfenergy: -482.2078245 hartree
pointgroup: C01 [X(C11H15N1)]
dipole: 0.4123398 0.231973 0.2856264 debye
polarizability: 153.8591738|-15.5118619|85.6569812|3.0617814|8.039069|117.7768728 unknown
InChI: InChI=1S/C11H15N/c1-10-7-12(8-10)9-11-5-3-2-4-6-11/h2-6,10H,7-9H2,1H3
charge 0 multiplicity 1
27 atoms
N  1.434363 -0.400482 0.301601
C  3.388969 0.381379 -0.16522
C  2.821209 -0.727098 0.79127
C  1.916241 0.920236 -0.245723
C  0.32343 -0.416578 1.264827
C  3.9516 -0.145282 -1.493412
C  -1.025255 -0.119037 0.614281
C  -2.049342 0.528502 1.349497
C  -1.28676 -0.512239 -0.722352
C  -3.315579 0.767063 0.767662
C  -2.549366 -0.27009 -1.308161
C  -3.570245 0.368175 -0.564948
H  4.102402 1.073027 0.313414
H  3.141335 -1.768851 0.606466
H  2.981316 -0.475079 1.86543
H  1.733466 1.772944 0.448413
H  1.522754 1.175504 -1.245552
H  0.487832 0.302986 2.109483
H  0.299882 -1.430433 1.716305
H  4.901817 -0.689916 -1.337179
H  4.147744 0.683094 -2.199752
H  3.232023 -0.837816 -1.966986
H  -1.85498 0.848797 2.381343
H  -0.484586 -1.001647 -1.285453
H  -4.098186 1.267804 1.349448
H  -2.737844 -0.578225 -2.343287
H  -4.549742 0.556565 -1.019216
