program: Gaussian 09
title: 000287977
version: EM64L-G09RevD.01
frameworkgroup: C1[X(C8H17N)]
method: RPBEPBE
basis: SDD
operation: Freq
keyword: #pfreq=noraman
keyword: PBEPBE/SDD
title: #p freq=noraman PBEPBE/SDD
converged: YES YES NO NO
title: Mulliken charges:
elementType: N C C C C C C C C H H H H H H H H H H H H H H H H H
charge: -0.165614 -0.120875 -0.139758 0.315666 -0.713626 -0.634945 -0.729539 -0.750350 -0.726633 0.201741 0.232677 0.219097 0.209481 0.224140 0.228572 0.185078 0.234185 0.233105 0.208904 0.201690 0.198832 0.251041 0.204829 0.204491 0.212542 0.215270
chargesum: 0.00000
title: Mulliken charges with hydrogens summed into heavy atoms:
elementType: N C C C C C C C C
charge: -0.165614 0.080866 0.092919 0.315666 -0.060908 0.012889 -0.085839 -0.095649 -0.094330
polarizability: 1.03161855e+02 6.25829068e-01 9.30703887e+01 -1.66975145e+00 -1.21314111e+00 8.17509146e+01
1716.lowfreq: -18.1312 -9.9827 -6.7289 0.0007 0.0008 0.0009 49.7927 124.1762 145.7774
frequency: 48.9818 124.1581 145.7449 170.5793 174.9300 194.8777 239.0755 243.0479 264.4171 269.4362 301.2397 316.1788 339.6858 404.2974 419.6060 504.4774 519.4967 698.1870 749.9793 777.0488 863.6329 923.3088 928.1868 940.1501 975.7702 999.6816 1006.9599 1019.4968 1033.0491 1079.4527 1099.2981 1119.9437 1129.3506 1155.0419 1211.9913 1225.1229 1252.9952 1291.1611 1330.2751 1364.6816 1367.2879 1386.1939 1389.2926 1406.5381 1430.7544 1456.8282 1460.8697 1463.1328 1464.9126 1470.7784 1477.4521 1479.0199 1480.3108 1484.0242 1498.1874 2909.5772 2962.5550 2965.5945 2973.6194 2977.5433 2991.4064 3027.3936 3055.0121 3060.9013 3061.9317 3062.4472 3068.1693 3073.2537 3074.2312 3075.3064 3083.3683 3100.5191
redmass: 2.7549 1.9483 1.2490 1.5789 1.4096 1.1292 1.0451 1.6358 1.2985 2.2085 2.5064 2.5875 2.2733 2.4517 2.5460 2.5222 3.0929 4.3140 3.3017 3.7596 1.9337 1.6129 1.6477 1.2393 1.3440 2.0234 1.4211 1.4931 1.4617 1.7990 1.4625 1.5610 1.5586 2.2402 2.2903 3.0327 2.7792 1.9950 1.2718 1.2166 1.2033 1.2626 1.2948 1.5342 1.4274 1.0509 1.0640 1.0478 1.0567 1.0546 1.0588 1.0608 1.0565 1.0486 1.0753 1.0477 1.0348 1.0352 1.0364 1.0365 1.0841 1.0815 1.1000 1.0990 1.0991 1.0993 1.0983 1.1001 1.0990 1.0969 1.0997 1.0923
irintensity: 0.3306 0.9811 0.2694 1.5161 0.6506 0.0956 0.0343 0.2697 0.4839 0.8053 0.5303 1.4361 2.9319 0.4122 3.5009 0.6444 2.3053 7.7085 1.7356 6.7906 4.2090 1.7674 3.3681 0.6390 8.8753 7.6865 1.2529 0.5710 1.9253 22.9681 2.5578 7.8512 3.5696 6.0422 15.1846 5.1302 29.1151 4.2800 0.5503 26.2899 23.8543 2.2953 22.7485 7.9069 13.8762 0.0768 8.5702 6.7088 1.8980 0.9787 1.7530 17.2194 12.8781 16.1280 23.0232 93.3231 34.0712 38.3509 32.1900 35.0739 33.2541 46.3412 1.1854 60.6761 20.5246 8.7070 90.0081 59.4149 6.1449 8.3138 32.6489 58.7228
temp: 298.150 k
press: 1.00000 atm
elementType: 7 6 6 6 6 6 6 6 6 1 1 1 1 1 1 1 1 1 1 1 1 1 1 1 1 1
symmnumber: 1
zpe: 610654.2 jmol-1
zpe.correction: 0.232586 hartree
zpe.thermalcorrener: 0.244481 hartree
zpe.thermalcorrenthalpy: 0.245425 hartree
zpe.thermalcorrgfe: 0.196158 hartree
zpe.sumelectzpe: -368.995462 hartree
zpe.sumelectthermal: -368.983567 hartree
zpe.sumelectthermalent: -368.982623 hartree
zpe.sumelectthermalfe: -369.031890 hartree
dipole: -0.7128 -0.6215 -1.2067
dipole: 1.5331
quadrupole: -55.7664 -58.1022 -59.6628
quadrupole: 0.1597 1.1686 -1.9360
quadrupole: 2.0774 -0.2584 -1.8190 0.1597 1.1686 -1.9360
hfenergy: -369.2280479 hartree
pointgroup: C01 [X(C8H17N1)]
dipole: -0.2713324 -0.389005 -0.3726577 debye
dipolederiv: -0.4489259 0.1922682 -0.157668 0.2468712 -0.6504655 0.0506564 -0.1562043 -0.0394958 -0.2681092 0.2709653 -0.0504238 0.0790826 -0.0095747 0.1607058 0.0199825 0.1204861 0.0381133 0.0959902 0.0653689 -0.0034749 0.0615804 0.0112076 0.2347916 0.0031751 0.0128283 0.0397936 0.215483 0.159399 0.0046855 -0.0330899 -0.039916 0.1209669 -0.0029281 0.0500035 -0.0064174 0.0813673 -0.0064956 -0.0630228 -0.0659148 -0.0883098 -0.0573378 -0.0103697 -0.0242537 -0.0115906 0.023354 0.2552405 -0.1267748 0.1170541 -0.108754 0.2792777 -0.0197484 0.1717594 -0.0392056 0.2456387 -0.0277317 -0.0243494 0.0399556 -0.0181747 -0.0543251 0.0494561 0.0026575 0.0551058 0.0258302 -0.014483 0.0253917 -0.0190622 0.0299589 0.0086236 -0.0299105 -0.0095519 -0.0499397 -0.0811657 -0.0161623 0.0548301 0.0178083 0.024161 -0.0480741 -0.0197895 -0.0075181 -0.0180033 0.0576505 -0.0332192 -0.0072403 -0.055416 0.0289878 0.0298537 -0.0676732 -0.0339994 -0.1037667 -0.1583996 0.0515029 -0.0318386 -0.0546687 -0.0246875 0.0084031 0.0320135 -0.0514144 0.0591853 -0.1260491 -0.1535489 -0.0130649 0.1017553 0.0459088 0.0710773 -0.0404768 0.1068333 -0.0334449 0.0419144 0.0650455 -0.0180266 -0.0031815 0.0071208 0.1015497 0.0466874 -0.0703393 -0.0004075 -0.1390048 0.0676037 0.0411683 -0.0078754 -0.0072142 -0.1616835 0.0547664 -0.0173262 0.047852 0.0931768 -0.132254 0.1323847 0.051034 0.0802827 0.0576028 -0.0234755 0.0938386 -0.0335888 0.0292875 -0.0236411 0.0401175 -0.0984727 -0.0691317 -0.04541 -0.1596793 -0.1827059 -0.0465016 -0.1354575 0.0515378 -0.0931122 0.0523357 -0.0549393 -0.0911962 0.1003187 -0.0007352 0.1208309 0.0236324 0.0737616 0.1130451 0.0166795 0.0788365 -0.1096576 -0.0211004 0.0190181 -0.0538672 0.0710552 -0.2170215 -0.053759 -0.0140136 -0.0290942 0.0806067 0.017872 -0.0529366 0.0029476 0.0722771 0.0893342 -0.0168935 -0.0529724 -0.0065426 0.0629265 -0.0636857 -0.0203931 -0.0093974 -0.188184 0.0779778 -0.0685829 0.0596915 -0.0557478 -0.0768581 0.1364172 0.0381138 0.0939197 -0.0305963 0.0897735 0.092991 0.0776166 0.083069 -0.0466297 -0.0673422 0.0551564 -0.0354669 0.0670995 -0.1923651 -0.0587625 -0.0875725 -0.0548476 0.085157 -0.0168302 -0.0285293 -0.0059756 0.0712748 0.0935659 -0.0053553 -0.0454385 0.005814 0.0540627 -0.0346227 -0.006465 -0.088619 -0.1784973 -0.2038221 0.0355172 -0.0414861 -0.0143197 0.0718576 -0.0127051 -0.0653177 0.0001653 0.0789757 0.0585939 -0.0977177 0.0622386 -0.0609644 -0.085825 0.078992 0.056995 0.1177745 0.0114562 unknown
polarizability: 103.2777883|0.0168675|90.9422733|-1.0635249|-4.5641411|83.7630967 unknown
InChI: InChI=1S/C8H17N/c1-6-7(9(6)5)8(2,3)4/h6-7H,1-5H3
charge 0 multiplicity 1
26 atoms
N  -1.085382 0.881059 0.133973
C  -0.145857 -0.185737 -0.358907
C  -1.277732 -0.556654 0.593065
C  1.347653 -0.083299 -0.001526
C  -2.440527 -1.429323 0.136284
C  -2.04064 1.476855 -0.829638
C  1.957398 1.059856 -0.858622
C  1.554011 0.238612 1.499475
C  2.028647 -1.432735 -0.35387
H  -0.314561 -0.51832 -1.401459
H  -1.028303 -0.673345 1.65565
H  -3.3744 -1.166254 0.66822
H  -2.629006 -1.346818 -0.948643
H  -2.218382 -2.490862 0.354227
H  -2.930951 1.835981 -0.282117
H  -2.381873 0.796377 -1.643063
H  -1.553247 2.348729 -1.301691
H  1.478553 2.023226 -0.60518
H  3.044753 1.153313 -0.676592
H  1.808605 0.873487 -1.939886
H  1.269807 -0.616769 2.140689
H  0.943024 1.111962 1.78954
H  2.617521 0.4673 1.69867
H  1.931776 -1.663314 -1.432343
H  3.10748 -1.398197 -0.111218
H  1.577028 -2.266231 0.216359
