program: Gaussian 09
title: 000287963
version: EM64L-G09RevD.01
frameworkgroup: C1[X(C7H12O2)]
method: RPBEPBE
basis: SDD
operation: Freq
keyword: #pfreq=noraman
keyword: PBEPBE/SDD
title: #p freq=noraman PBEPBE/SDD
converged: YES YES NO NO
title: Mulliken charges:
elementType: O O C C C C C C C H H H H H H H H H H H H
charge: -0.291119 -0.269463 -0.014292 -0.319216 0.224626 0.223038 -0.708292 -0.779989 -0.781251 0.230504 0.212656 0.215778 0.207988 0.222000 0.241000 0.235350 0.219653 0.237627 0.235604 0.219707 0.238090
chargesum: 0.00000
title: Mulliken charges with hydrogens summed into heavy atoms:
elementType: O O C C C C C C C
charge: -0.291119 -0.269463 0.216213 0.109217 0.224626 0.223038 -0.037304 -0.087358 -0.087850
polarizability: 9.75281479e+01 -1.08606728e+00 8.78830848e+01 -1.45847052e-01 1.19906718e-01 5.89583995e+01
1716.lowfreq: -15.5411 -4.1181 -0.0011 -0.0008 -0.0006 6.0814 92.9326 111.1889 125.9916
frequency: 92.9195 111.1720 125.9741 141.1932 194.2869 228.2946 248.0548 303.6900 338.1025 382.0424 415.7812 463.9645 495.4012 545.5885 623.4826 683.5079 811.8615 855.2605 918.5927 936.9479 973.2959 1026.2028 1044.4455 1047.6303 1093.6495 1116.3125 1124.1914 1159.0521 1182.2702 1216.4018 1257.8345 1304.7788 1330.4795 1366.1067 1392.8134 1396.7611 1406.2388 1450.9819 1452.4900 1455.8203 1462.4829 1472.9701 1476.7377 1478.7648 1705.1520 2971.3643 2976.3078 2978.8406 2987.6752 2993.3796 3049.7716 3050.4558 3085.9532 3093.9370 3100.1249 3106.1543 3115.2477
redmass: 3.4660 1.0220 1.0425 2.4229 1.0744 3.0259 2.6107 2.4740 3.6650 2.7053 4.0850 2.8197 4.9301 4.8766 3.8891 4.3950 2.8111 2.2429 1.9895 1.5794 2.1926 2.8510 1.4040 1.4447 2.3222 2.0845 2.1886 2.2365 4.2599 1.3936 2.5736 1.3621 1.2659 1.4863 1.2438 1.3724 1.2371 1.0888 1.0510 1.0445 1.0532 1.0466 1.0696 1.0476 7.5102 1.0763 1.0382 1.0392 1.0715 1.0367 1.0979 1.0977 1.0999 1.1000 1.0997 1.0976 1.0951
irintensity: 6.5119 0.1794 0.0690 4.1841 0.4912 3.4211 2.9120 0.2035 1.4617 2.7511 0.9246 2.8931 2.1757 0.4771 7.8137 10.8389 20.6975 9.8677 21.7066 1.8928 5.4327 45.7470 8.4400 0.5406 22.2710 41.3407 3.5230 50.9474 162.9657 14.1147 6.6669 2.6337 9.2574 2.5252 17.5539 14.0058 26.3376 2.2133 0.7640 24.2942 14.2941 4.6770 23.9197 9.4083 21.1365 20.5659 55.0130 25.8127 57.6158 29.0987 1.0522 42.2341 5.2868 52.9539 21.5415 24.3332 24.0266
temp: 298.150 k
press: 1.00000 atm
elementType: 8 8 6 6 6 6 6 6 6 1 1 1 1 1 1 1 1 1 1 1 1
symmnumber: 1
zpe: 465462.1 jmol-1
zpe.correction: 0.177285 hartree
zpe.thermalcorrener: 0.187456 hartree
zpe.thermalcorrenthalpy: 0.188400 hartree
zpe.thermalcorrgfe: 0.142426 hartree
zpe.sumelectzpe: -423.638335 hartree
zpe.sumelectthermal: -423.628165 hartree
zpe.sumelectthermalent: -423.627220 hartree
zpe.sumelectthermalfe: -423.673194 hartree
dipole: -0.7034 -0.0185 -0.0082
dipole: 0.7037
quadrupole: -47.2898 -57.9103 -54.8903
quadrupole: 4.0882 0.3952 -0.6337
quadrupole: 6.0737 -4.5468 -1.5268 4.0882 0.3952 -0.6337
hfenergy: -423.8156206 hartree
pointgroup: C01 [X(C7H12O2)]
dipole: -0.2767111 0.0086088 0.0025874 debye
dipolederiv: -1.3208667 -0.1318371 0.0811854 0.1661128 -0.4960813 -0.0006413 0.0333799 -0.0142351 -0.2652782 -0.908106 0.4052019 -0.0716315 0.167142 -0.7907334 0.0597664 -0.0219941 -0.0004361 -0.2692422 0.5715693 -0.0217434 -0.0855492 -0.3936657 0.2340063 0.0647255 -0.1175017 0.066141 0.3478778 0.5035195 -0.2448508 0.1149872 0.1127002 0.1235474 0.038481 0.1161597 0.011744 0.325384 0.8626903 0.0868873 -0.0730781 0.2121956 0.2361756 0.0029971 0.021768 -0.0574826 -0.0888923 0.4109472 -0.2444405 0.0631575 -0.3662593 0.6022796 -0.0538277 -0.058586 -0.0385674 -0.0932168 -0.134116 -0.0293048 -0.0207007 -0.0729145 0.0408978 0.0044242 0.0092789 0.0084963 0.0645326 -0.0726147 0.018603 0.0117206 0.0994076 -0.0127892 -0.0219898 0.0267205 0.0076126 0.1040197 -0.0937019 0.0570524 -0.028062 -0.0320133 0.0305895 -0.0081561 -0.013417 0.0228133 0.1048975 -0.0066753 -0.0057154 -0.0583331 0.0719092 0.0160482 -0.0353126 0.0388521 -0.0335174 -0.1689177 -0.0107067 0.0242636 -0.0090286 -0.0625111 0.0822038 -0.0749432 -0.0721105 0.0288626 -0.1604964 -0.0288917 0.1069714 0.0006481 0.1331706 -0.0569409 -0.0232247 0.018014 -0.0502111 0.0793932 -0.0321228 0.0779107 0.0348263 0.14112 -0.0272536 -0.0668688 0.044072 -0.0639575 0.0758578 0.0814282 -0.0018953 0.0126723 -0.0154436 0.0959233 -0.0088364 -0.0627758 -0.0262855 -0.1393366 0.0694576 -0.0310876 0.012295 -0.1015979 -0.0609292 0.0876495 0.0185141 0.0887815 0.0557565 0.102183 0.0112893 0.0361019 0.0193213 -0.0596227 0.0908411 0.006956 0.1543339 -0.0654307 -0.1453418 0.0039615 0.035654 -0.0627187 0.0943463 0.0153597 0.0269728 0.0134527 0.1046641 0.0861122 -0.0516189 -0.0769078 -0.0099688 -0.0298578 -0.0840958 -0.0491646 -0.1340121 -0.0258142 0.0084989 -0.0813113 0.03562 -0.0882733 0.0277365 0.089136 0.1004273 0.1206057 -0.0658622 -0.0072362 0.081688 -0.0191615 0.1561301 -0.0369267 0.0396861 -0.0139506 0.0311801 0.1033289 0.0639738 -0.0300241 0.0035843 -0.0738431 -0.0126192 -0.1151702 -0.0516152 -0.135319 -0.0232248 unknown
polarizability: 97.5375336|1.0427719|87.8714754|0.2060375|-0.2429983|58.9606232 unknown
InChI: InChI=1S/C7H12O2/c1-5-4-8-6(2)7(3)9-5/h5H,4H2,1-3H3
charge 0 multiplicity 1
21 atoms
O  -0.693505 -1.097274 -0.026488
O  0.327734 1.613293 0.006358
C  -1.550796 0.050944 0.356494
C  -1.052739 1.297515 -0.393845
C  0.708504 -0.807412 -0.031364
C  1.192036 0.4714 0.020918
C  -2.986974 -0.340019 0.015305
C  1.499966 -2.084615 -0.096028
C  2.627594 0.911331 0.099699
H  -1.426857 0.219974 1.446643
H  -1.091657 1.111834 -1.486682
H  -1.64716 2.191409 -0.142679
H  -3.696083 0.431166 0.3665
H  -3.109387 -0.467153 -1.074944
H  -3.241768 -1.296225 0.502927
H  1.380212 -2.67376 0.833111
H  2.572807 -1.897189 -0.257455
H  1.130647 -2.711362 -0.929426
H  2.940763 1.422218 -0.830733
H  3.307609 0.064955 0.282119
H  2.750154 1.635869 0.926571
